2,2,3-Trimethyl-thiirane
- Formula: C5H10S
- Molecular weight: 102.198
- IUPAC Standard InChIKey: TWNJQGQIVBDVAB-UHFFFAOYSA-N
- CAS Registry Number: 53971-47-4
- Chemical structure:
View 3d structure (requires JavaScript / HTML 5) - Other names: Trimethylthiirane

Condensed phase thermochemistry data

Data compiled by: Hussein Y. Afeefy, Joel F. Liebman, and Stephen E. Stein
Quantity | Value | Units | Method | Reference | Comment |
---|---|---|---|---|---|
ΔfH°liquid | -61. ± 1. | kJ/mol | Ccr | Sunner, 1963 | |
Quantity | Value | Units | Method | Reference | Comment |
ΔcH°liquid | -3938.2 | kJ/mol | Ccr | Sunner, 1963 |

Normal alkane RI, non-polar column, custom temperature program

Column type | Active phase | I | Reference | Comment |
---|---|---|---|---|
Capillary | Methyl Silicone | 723. | Farkas, Héberger, et al., 2004 | Program: not specified |

References

Sunner, 1963
Sunner, S.,
Corrected heat of combustion and formation values for a number of organic sulphur compounds,
Acta Chem. Scand., 1963, 17, 728-730. [all data]
Farkas, Héberger, et al., 2004
Farkas, O.; Héberger, K.; Zenkevich, I.G.,
Quantitative structure-retention relationships. XIV. Prediction of gas chromatographic retention indices for saturated O-, N-, and S-heterocyclic compounds,
Chemom. Intell. Lab. Syst., 2004, 72, 2, 173-184, https://doi.org/10.1016/j.chemolab.2004.01.012
. [all data]