2-Octene, 4-ethyl-
- Formula: C10H20
- Molecular weight: 140.2658
- IUPAC Standard InChIKey: KWJKRSHQUPUUBI-VMPITWQZSA-N
- CAS Registry Number: 53966-52-2
- Chemical structure:
View 3d structure (requires JavaScript / HTML 5) - Other names: 4-Ethyl-2-octene

Phase change data

Data compiled by: Thermodynamics Research Center, NIST Boulder Laboratories, Chris Muzny director
Quantity | Value | Units | Method | Reference | Comment |
---|---|---|---|---|---|
Tboil | 437.4 | K | N/A | Pomerantz, Fookson, et al., 1954 | Uncertainty assigned by TRC = 2. K |
Tboil | 437.4 | K | N/A | Pomerantz, Fookson, et al., 1954, 2 | Uncertainty assigned by TRC = 2. K |

References

Pomerantz, Fookson, et al., 1954
Pomerantz, P.; Fookson, A.; Mears, T.W.; Rothberg, S.; Howard, F.L.,
Synthesis and Physical Properties of Several Acetylenic Hydrocarbons,
J. Res. Natl. Bur. Stand. (U. S.), 1954, 52, 51. [all data]
Pomerantz, Fookson, et al., 1954, 2
Pomerantz, P.; Fookson, A.; Mears, T.W.; Rothberg, S.; Howard, F.L.,
Synth. and Phys. Prop. of Several Aliphatic and Alicyclic Hydrocarbons hydrocarbons,
J. Res. Natl. Bur. Stand. (U. S.), 1954, 52, 59-65. [all data]