2-methylbutane-2,3-diol
- Formula: C5H12O2
- Molecular weight: 104.1476
- IUPAC Standard InChIKey: IDEOPBXRUBNYBN-UHFFFAOYSA-N
- CAS Registry Number: 5396-58-7
- Chemical structure:
View 3d structure (requires JavaScript / HTML 5) - Species with the same structure:
- Other names: 2-methyl-2,3-butanediol

Phase change data

Data compiled by: Thermodynamics Research Center, NIST Boulder Laboratories, Chris Muzny director
Quantity | Value | Units | Method | Reference | Comment |
---|---|---|---|---|---|
Tboil | 446.65 | K | N/A | Hennion and Watson, 1958 | Uncertainty assigned by TRC = 3. K |
Tboil | 446.15 | K | N/A | Nazarov, 1940 | Uncertainty assigned by TRC = 4. K |
Tboil | 450.65 | K | N/A | Henry, 1906 | Uncertainty assigned by TRC = 3. K |

References

Hennion and Watson, 1958
Hennion, G.; Watson, E.,
J. Org. Chem., 1958, 23, 656-8. [all data]
Nazarov, 1940
Nazarov, I.N.,
Izv. Akad. Nauk SSSR, 1940, 1940, 195. [all data]
Henry, 1906
Henry, L.,
C. R. Hebd. Seances Acad. Sci., 1906, 144, 1404. [all data]