1,5-Decadiyne
- Formula: C10H14
- Molecular weight: 134.2182
- IUPAC Standard InChIKey: IWIDILFDSIIOSB-UHFFFAOYSA-N
- CAS Registry Number: 53963-03-4
- Chemical structure:
View 3d structure (requires JavaScript / HTML 5) - Permanent link for this species. Use this link for bookmarking this species for future reference.

Phase change data

Data compiled by: Robert L. Brown and Stephen E. Stein
Reduced pressure boiling point
Tboil (K) | Pressure (bar) | Reference |
---|---|---|
353. | 0.016 | Farchan Laboratories, 1990 |

References

Farchan Laboratories, 1990
Farchan Laboratories,
Research Chemicals Catalog, Farchan Laboratories, Gainesville, FL, 1990, 91. [all data]