1-Propanamine, N,2-dimethyl-N-nitro-
- Formula: C5H12N2O2
- Molecular weight: 132.1610
- IUPAC Standard InChIKey: VHQJQNRZBRJXCE-UHFFFAOYSA-N
- CAS Registry Number: 53951-45-4
- Chemical structure:
View 3d structure (requires JavaScript / HTML 5) - Permanent link for this species. Use this link for bookmarking this species for future reference.

Phase change data

Data compiled by: Thermodynamics Research Center, NIST Boulder Laboratories, Chris Muzny director
Quantity | Value | Units | Method | Reference | Comment |
---|---|---|---|---|---|
Tfus | 295.65 | K | N/A | Bruhl, 1897 | Uncertainty assigned by TRC = 1. K |

References

Bruhl, 1897
Bruhl, J.W.,
Spectrochemistry of nitrogen containing compounds V,
Z. Phys. Chem., Stoechiom. Verwandtschaftsl., 1897, 22, 373. [all data]