2,2-Metaparacyclophane
- Formula: C16H16
- Molecular weight: 208.2982
- IUPAC Standard InChIKey: ALDQBAILWKRGEG-UHFFFAOYSA-N
- CAS Registry Number: 5385-36-4
- Chemical structure:
View 3d structure (requires JavaScript / HTML 5) - Permanent link for this species. Use this link for bookmarking this species for future reference.

Gas phase thermochemistry data

Data compiled by: Hussein Y. Afeefy, Joel F. Liebman, and Stephen E. Stein
Quantity | Value | Units | Method | Reference | Comment |
---|---|---|---|---|---|
ΔfH°gas | 218.3 ± 3.1 | kJ/mol | Ccb | Shieh, McNally, et al., 1969 |

Condensed phase thermochemistry data

Data compiled by: Hussein Y. Afeefy, Joel F. Liebman, and Stephen E. Stein
Quantity | Value | Units | Method | Reference | Comment |
---|---|---|---|---|---|
ΔfH°solid | 130.8 ± 2.1 | kJ/mol | Ccb | Shieh, McNally, et al., 1969 | |
Quantity | Value | Units | Method | Reference | Comment |
ΔcH°solid | -8713.7 ± 1.3 | kJ/mol | Ccb | Shieh, McNally, et al., 1969 | Corresponding ΔfHºsolid = 130.9 kJ/mol (simple calculation by NIST; no Washburn corrections) |

Phase change data

Data compiled as indicated in comments:
ALS - Hussein Y. Afeefy, Joel F. Liebman, and Stephen E. Stein
DRB - Donald R. Burgess, Jr.
AC - William E. Acree, Jr., James S. Chickos
Quantity | Value | Units | Method | Reference | Comment |
---|---|---|---|---|---|
ΔsubH° | 88. ± 2. | kJ/mol | V | Shieh, McNally, et al., 1969 | ALS |
ΔsubH° | 87.5 | kJ/mol | N/A | Shieh, McNally, et al., 1969 | DRB |
ΔsubH° | 87.5 ± 0.9 | kJ/mol | ME | Shieh, McNally, et al., 1969 | See also Pedley and Rylance, 1977.; AC |
Enthalpy of sublimation
ΔsubH (kJ/mol) | Temperature (K) | Method | Reference | Comment |
---|---|---|---|---|
86.6 | 336. | ME | Shieh, McNally, et al., 1969 | Based on data from 311. to 328. K. See also Pedley and Rylance, 1977 and Stephenson and Malanowski, 1987.; AC |
Enthalpy of fusion
ΔfusH (kJ/mol) | Temperature (K) | Reference | Comment |
---|---|---|---|
12.76 | 354. | Shieh, McNally, et al., 1969 | AC |

References

Shieh, McNally, et al., 1969
Shieh, C.; McNally, D.; Boyd, R.H.,
The heats of combustion and strain energies of some cyclophanes,
Tetrahedron, 1969, 3653-3665. [all data]
Pedley and Rylance, 1977
Pedley, J.B.; Rylance, J.,
, Computer Analysed Thermochemical Data: Organic and Organometallic Compounds, University of Sussex, Brighton, 1977. [all data]
Stephenson and Malanowski, 1987
Stephenson, Richard M.; Malanowski, Stanislaw,
Handbook of the Thermodynamics of Organic Compounds, 1987, https://doi.org/10.1007/978-94-009-3173-2
. [all data]