Cyclopropane, 1-ethyl-1-methyl-
- Formula: C6H12
- Molecular weight: 84.1595
- IUPAC Standard InChIKey: CXYUCHDVLWUDNS-UHFFFAOYSA-N
- CAS Registry Number: 53778-43-1
- Chemical structure:
View 3d structure (requires JavaScript / HTML 5) - Other names: 1-Ethyl-1-methylcyclopropane

Phase change data

Data compiled by: Thermodynamics Research Center, NIST Boulder Laboratories, Chris Muzny director
Quantity | Value | Units | Method | Reference | Comment |
---|---|---|---|---|---|
Tboil | 329.9 | K | N/A | Slobodin, Grigor'eva, et al., 1953 | Uncertainty assigned by TRC = 1. K |
Tboil | 329.94 | K | N/A | Derfer, Greenlee, et al., 1949 | Uncertainty assigned by TRC = 0.2 K |
Tboil | 329.92 | K | N/A | Anonymous, 1948 | Uncertainty assigned by TRC = 0.3 K |
Quantity | Value | Units | Method | Reference | Comment |
Tfus | 142.92 | K | N/A | Derfer, Greenlee, et al., 1949 | Uncertainty assigned by TRC = 0.2 K |
Tfus | 142.94 | K | N/A | Anonymous, 1948 | Uncertainty assigned by TRC = 0.2 K |

Kovats' RI, non-polar column, isothermal

Column type | Active phase | Temperature (C) | I | Reference | Comment |
---|---|---|---|---|---|
Packed | Squalane | 20. | 567. | Bogoslovsky, Anvaer, et al., 1978 | |
Capillary | Squalane | 120. | 567.0 | Schomburg and Dielmann, 1973 | Column length: 100. m; Column diameter: 0.25 mm |

Normal alkane RI, non-polar column, custom temperature program

Column type | Active phase | I | Reference | Comment |
---|---|---|---|---|
Capillary | Squalane | 567. | Chen, 2008 | Program: not specified |

References

Slobodin, Grigor'eva, et al., 1953
Slobodin, Ya.M.; Grigor'eva, V.I.; Shmulyakovskii, Ya.E.,
Zh. Obshch. Khim., 1953, 23, 1665. [all data]
Derfer, Greenlee, et al., 1949
Derfer, J.M.; Greenlee, K.W.; Boord, C.E.,
A New Synthesis of Monoalkylcyclobutanes: Reduction of Neopentyl Type Tribromides,
J. Am. Chem. Soc., 1949, 71, 175. [all data]
Anonymous, 1948
Anonymous, R.,
, Am. Pet. Inst. Res. Proj. 6, Natl. Bur. Stand., 1948. [all data]
Bogoslovsky, Anvaer, et al., 1978
Bogoslovsky, Yu.N.; Anvaer, B.I.; Vigdergauz, M.S.,
Chromatographic constants in gas chromatography (in Russian), Standards Publ. House, Moscow, 1978, 192. [all data]
Schomburg and Dielmann, 1973
Schomburg, G.; Dielmann, G.,
Use of retention increments for identification and correlation of saturated and unsaturated cyclopropane hydrocarbons by means of Kovats indices,
Anal. Chem., 1973, 45, 9, 1647-1658, https://doi.org/10.1021/ac60331a021
. [all data]
Chen, 2008
Chen, H.-F.,
Quantitative prediction of gas chromatography retention indices with support vector machines, radial basis neutral networks and multiple linear regression,
Anal. Chim. Acta, 2008, 609, 1, 24-36, https://doi.org/10.1016/j.aca.2008.01.003
. [all data]