2,2,8,8-Tetramethyl-1,3,7,9-tetraoxycyclododecane

Phase change data

Data compiled as indicated in comments:
TRC - Thermodynamics Research Center, NIST Boulder Laboratories, Chris Muzny director
AC - William E. Acree, Jr., James S. Chickos

Quantity Value Units Method Reference Comment
Tfus383.0KN/ABorgen, 1975Uncertainty assigned by TRC = 0.1 K; TRC

Enthalpy of fusion

ΔfusH (kJ/mol) Temperature (K) Reference Comment
23.4383.Borgen, Borgen, et al., 1975AC

In addition to the Thermodynamics Research Center (TRC) data available from this site, much more physical and chemical property data is available from the following TRC products:

References

Borgen, 1975
Borgen, G., Syntheses and Conformations of Monomeric and Dimeric Cyclic Dimethylketals., Acta Chem. Scand., 1975, 29b, 265, https://doi.org/10.3891/acta.chem.scand.29b-0265 . [all data]

Borgen, Borgen, et al., 1975
Borgen, Gerd; Borgen, Gerd; Dale, Johannes; Gaupset, Gudmund; Schroll, G.; Altona, C., Syntheses and Conformations of Monomeric and Dimeric Cyclic Dimethylketals., Acta Chem. Scand., 1975, 29b, 265-272, https://doi.org/10.3891/acta.chem.scand.29b-0265 . [all data]