Methamphetamine
- Formula: C10H15N
- Molecular weight: 149.2328
- IUPAC Standard InChIKey: MYWUZJCMWCOHBA-SECBINFHSA-N
- CAS Registry Number: 537-46-2
- Chemical structure:
View 3d structure (requires JavaScript / HTML 5) - Stereoisomers:
- Other names: Benzeneethanamine, N,α-dimethyl-, (S)-; Phenethylamine, N,α-dimethyl-, (S)-(+)-; (+)-(S)-Deoxyephedrine; (+)-Methamphetamine; (+)-Methylamphetamine; (+)-N-Methylamphetamine; D-(S)-methamphetamine; D-deoxyephedrine; D-desoxyephedrine; D-methamphetamine; D-methylamphetamine; D-N-methylamphetamine; D-N,α-dimethylphenethylamine; D-phenylisopropylmethylamine; Benzeneethanamine, N,α-dimethyl-, (+)-; L-Methamphetamine; Metamphetamine; Methyl-β-phenylisopropylamine; Methylamphetamine; N-Methylamphetamine; Norodin; 1-Phenyl-2-methylaminopropane; D-1-Phenyl-2-methylaminopropan; D-1-Phenyl-2-methylaminopropane; Phenethylamine, N,α-dimethyl-, (+)-; Metamfetamine; (+)-N,α-Dimethylphenethylamine; Desyphed; (+)-(S)-N-α-Dimethylphenethylamine; (+)-2-(N-Methylamino)-1-phenylpropane; (+)-N,α-Dimethyl-β-phenylethylamine; (S)-(+)-Deoxyephedrine; (S)-Methamphetamine; (S)-Methylamphetamine; NSC 25115; N-α-dimethylphenethylamine

Phase change data

Data compiled by: William E. Acree, Jr., James S. Chickos
Enthalpy of vaporization
ΔvapH (kcal/mol) | Temperature (K) | Method | Reference | Comment |
---|---|---|---|---|
12.6 | 285. | A | Stephenson and Malanowski, 1987 | Based on data from 270. to 304. K. |

References

Stephenson and Malanowski, 1987
Stephenson, Richard M.; Malanowski, Stanislaw,
Handbook of the Thermodynamics of Organic Compounds, 1987, https://doi.org/10.1007/978-94-009-3173-2
. [all data]