Trilinolein

Reaction thermochemistry data

Data compiled by: Hussein Y. Afeefy, Joel F. Liebman, and Stephen E. Stein

Individual Reactions

6Hydrogen + Trilinolein = Tristearin

By formula: 6H2 + C57H98O6 = C57H110O6

Quantity Value Units Method Reference Comment
Δr-757.05kJ/molChydRogers and Choudhury, 1978liquid phase; solvent: Hexane

Condensed phase thermochemistry data

Data compiled by: Hussein Y. Afeefy, Joel F. Liebman, and Stephen E. Stein

Quantity Value Units Method Reference Comment
Δcliquid-34555.7 ± 1.3kJ/molCcbFreedman, Bagby, et al., 1989Corresponding Δfliquid = -1880.1 kJ/mol (simple calculation by NIST; no Washburn corrections)

References

Rogers and Choudhury, 1978
Rogers, D.W.; Choudhury, D.N., Heats of hydrogenation of large molecules. Part 3 - Five simple unsaturated triglycerides (triacylglycerols), J. Chem. Soc. Faraday Trans. 1, 1978, 74, 2868-2872. [all data]