9-Octadecenoic acid, 1,2,3-propanetriyl ester, (E,E,E)-
- Formula: C57H104O6
- Molecular weight: 885.4321
- IUPAC Standard InChIKey: PHYFQTYBJUILEZ-WUOFIQDXSA-N
- CAS Registry Number: 537-39-3
- Chemical structure:
- Other names: 2,3-Bis[(9E)-9-octadecenoyloxy]propyl (9E)-9-octadecenoate; 1,2,3-propanetriyl tris[(E)-9-octadecenoate]

Reaction thermochemistry data

Data compiled by: Hussein Y. Afeefy, Joel F. Liebman, and Stephen E. Stein
Individual Reactions
By formula: 3H2 + C57H104O6 = C57H110O6
Quantity | Value | Units | Method | Reference | Comment |
---|---|---|---|---|---|
ΔrH° | -376.9 | kcal/mol | Chyd | Rogers and Choudhury, 1978 | liquid phase; solvent: Hexane |

References

Rogers and Choudhury, 1978
Rogers, D.W.; Choudhury, D.N.,
Heats of hydrogenation of large molecules. Part 3 - Five simple unsaturated triglycerides (triacylglycerols),
J. Chem. Soc. Faraday Trans. 1, 1978, 74, 2868-2872. [all data]