butane-1-d
- Formula: C4H9D
- Molecular weight: 59.1284
- CAS Registry Number: 53716-53-3

Phase change data

Data compiled by: Thermodynamics Research Center, NIST Boulder Laboratories, Chris Muzny director
Quantity | Value | Units | Method | Reference | Comment |
---|---|---|---|---|---|
Tfus | 134.69 | K | N/A | Fisher, 1954 | Uncertainty assigned by TRC = 0.15 K |

References

Fisher, 1954
Fisher, J.G.,
, Diss. Abstr. No. 65, 471, 1954. [all data]