2-Acetyl-5-bromothiophene
- Formula: C6H5BrOS
- Molecular weight: 205.072
- IUPAC Standard InChIKey: IGBZCOWXSCWSHO-UHFFFAOYSA-N
- CAS Registry Number: 5370-25-2
- Chemical structure:
View 3d structure (requires JavaScript / HTML 5) - Other names: 5-Bromo-2-thienyl methyl ketone; 5-Bromo 2-acetylthiophene; Ethanone, 1-(5-bromo-2-thienyl)-; Ketone, 5-bromo-2-thienyl methyl; 1-(5-bromo-2-thienyl)ethan-1-one

Phase change data

Data compiled by: Robert L. Brown and Stephen E. Stein
Quantity | Value | Units | Method | Reference | Comment |
---|---|---|---|---|---|
Tfus | 367. | K | N/A | Buckingham and Donaghy, 1982 |
Reduced pressure boiling point
Tboil (K) | Pressure (bar) | Reference |
---|---|---|
376.2 | 0.005 | Aldrich Chemical Company Inc., 1990 |
378. | 0.0003 | Buckingham and Donaghy, 1982 |

References

Buckingham and Donaghy, 1982
Buckingham, J.; Donaghy, S.M.,
Dictionary of Organic Compounds: Fifth Edition, Chapman and Hall, New York, 1982, 1. [all data]
Aldrich Chemical Company Inc., 1990
Aldrich Chemical Company Inc.,
Catalog Handbook of Fine Chemicals, Aldrich Chemical Company, Inc., Milwaukee WI, 1990, 1. [all data]
Vol'kenstein, Lopatin, et al., 1961
Vol'kenstein, Y.B.; Lopatin, B.V.; Petukhov, V.A.,
Study of product distribution of bromination of 2-thienyl ketones in the pressure of the excess of aluminum chloride,
Izv. Akad. Nauk SSSR, Ser. Khim., 1961, 1879-1883. [all data]