3,3'-Di-tert-butylbiphenyl
- Formula: C20H26
- Molecular weight: 266.4204
- IUPAC Standard InChIKey: VBEKOHMKJMZVGZ-UHFFFAOYSA-N
- CAS Registry Number: 53692-24-3
- Chemical structure:
View 3d structure (requires JavaScript / HTML 5) - Permanent link for this species. Use this link for bookmarking this species for future reference.

Reaction thermochemistry data

Data compiled by: Hussein Y. Afeefy, Joel F. Liebman, and Stephen E. Stein
Individual Reactions
By formula: C20H26 = C20H26
Quantity | Value | Units | Method | Reference | Comment |
---|---|---|---|---|---|
ΔrH° | -0.32 ± 0.16 | kcal/mol | Eqk | Roshchupkina, Nesterova, et al., 1987 | liquid phase; T=364.1 K |
By formula: C20H26 = C18H22
Quantity | Value | Units | Method | Reference | Comment |
---|---|---|---|---|---|
ΔrH° | -0.22 ± 0.093 | kcal/mol | Eqk | Roshchupkina, Nesterova, et al., 1987 | liquid phase; T=359 K |

References

Roshchupkina, Nesterova, et al., 1987
Roshchupkina, I.Yu.; Nesterova, T.N.; Rozhnov, A.M.,
Equilibria of isomeric transformations of alkylbiphenyls,
J. Chem. Thermodyn., 1987, 19, 299-306. [all data]