Benzoic acid, 3-methoxy-, methyl ester
- Formula: C9H10O3
- Molecular weight: 166.1739
- IUPAC Standard InChIKey: DUKYPQBGYRJVAN-UHFFFAOYSA-N
- CAS Registry Number: 5368-81-0
- Chemical structure:

Gas phase ion energetics data

Data evaluated by: Edward P. Hunter and Sharon G. Lias
Quantity | Value | Units | Method | Reference | Comment |
---|---|---|---|---|---|
Proton affinity (review) | 856.7 | kJ/mol | N/A | Hunter and Lias, 1998 | |
Quantity | Value | Units | Method | Reference | Comment |
Gas basicity | 825.8 | kJ/mol | N/A | Hunter and Lias, 1998 |

Kovats' RI, non-polar column, isothermal

Column type | Active phase | Temperature (C) | I | Reference | Comment |
---|---|---|---|---|---|
Packed | OV-1 | 150. | 1316. | Fedoreev and Maksimov, 1977 | Gaschrom; Column length: 1.5 m |

Van Den Dool and Kratz RI, non-polar column, temperature ramp

Column type | Active phase | I | Reference | Comment |
---|---|---|---|---|
Capillary | VF-5MS | 1352. | Todua, 2011 | 30. m/0.25 mm/0.25 μm, He; Tstart: 60. C; Tend: 270. C |
Capillary | BP-1 | 1331. | Tan, Wilkins, et al., 1989 | H2, 40. C @ 2. min, 4. K/min, 240. C @ 75. min; Column length: 12. m |

Van Den Dool and Kratz RI, non-polar column, custom temperature program

Column type | Active phase | I | Reference | Comment |
---|---|---|---|---|
Capillary | 5 % Phenyl methyl siloxane | 1358.9 | Zaikin, 2003 | Column length: 30. m; Column diameter: 0.19 mm; Program: 50 C to 120 C at 5 C/min; 120 C to 290 C at 12 C/min |

Normal alkane RI, non-polar column, custom temperature program

Column type | Active phase | I | Reference | Comment |
---|---|---|---|---|
Capillary | HP-1 | 1325. | Rowland, Blackman, et al., 1995 | 25. m/0.25 mm/0.25 μm; Program: 30 0C (4 min) 6 K/min -> 200 0C 15 K/min -> 250 0C (20 min) |

References

Hunter and Lias, 1998
Hunter, E.P.; Lias, S.G.,
Evaluated Gas Phase Basicities and Proton Affinities of Molecules: An Update,
J. Phys. Chem. Ref. Data, 1998, 27, 3, 413-656, https://doi.org/10.1063/1.556018
. [all data]
Fedoreev and Maksimov, 1977
Fedoreev, S.A.; Maksimov, O.B.,
The study of the composition of aromatic esters by gas-liquid chromatography,
Solid Fuel Chem. (Engl. Transl.), 1977, 17-22. [all data]
Todua, 2011
Todua, N.G.,
Retention Data. NIST Mass Spectrometry Data Center., NIST Mass Spectrometry Data Center, 2011. [all data]
Tan, Wilkins, et al., 1989
Tan, S.T.; Wilkins, A.L.; Holland, P.T.; McGhie, T.K.,
Extractives from New Zealand unifloral honeys. 2. Degraded carotenoids and other substances from heather honey,
J. Agric. Food Chem., 1989, 37, 5, 1217-1221, https://doi.org/10.1021/jf00089a004
. [all data]
Zaikin, 2003
Zaikin, V.G.,
Personal Communication: Retention indices measured during the period 2001 to 2003, 2003. [all data]
Rowland, Blackman, et al., 1995
Rowland, C.Y.; Blackman, A.J.; D'Arcy, B.R.; Rintoul, G.B.,
Comparison of organic extractives found in leatherwood (Eucryphia lucida) honey and leatherwood flowers and leaves,
J. Agric. Food Chem., 1995, 43, 3, 753-763, https://doi.org/10.1021/jf00051a036
. [all data]