[2,2,2-Trifluoro-1,1-bis(trifluoromethyl)ethyl](trifluoromethyl)-diazene

Phase change data

Data compiled by: William E. Acree, Jr., James S. Chickos

Enthalpy of vaporization

ΔvapH (kJ/mol) Temperature (K) Reference
23.7309.Kirchmeier, Lasouris, et al., 1975

References

Kirchmeier, Lasouris, et al., 1975
Kirchmeier, Robert L.; Lasouris, U.I.; Shreeve, Jean'ne M., Polar and free-radical additions of fluorinated species to unsaturated carbon-nitrogen systems, Inorg. Chem., 1975, 14, 3, 592-596, https://doi.org/10.1021/ic50145a031 . [all data]