p-Cymen-7-ol

Phase change data

Data compiled as indicated in comments:
TRC - Thermodynamics Research Center, NIST Boulder Laboratories, Chris Muzny director
BS - Robert L. Brown and Stephen E. Stein
AC - William E. Acree, Jr., James S. Chickos

Quantity Value Units Method Reference Comment
Tboil521.8KN/APerkin, 1896Uncertainty assigned by TRC = 1. K; TRC
Tboil505.15KN/AKahlbaum, 1884Uncertainty assigned by TRC = 1.5 K; TRC

Reduced pressure boiling point

Tboil (K) Pressure (bar) Reference Comment
408.70.035Aldrich Chemical Company Inc., 1990BS

Enthalpy of vaporization

ΔvapH (kJ/mol) Temperature (K) Method Reference Comment
59.7362.AStephenson and Malanowski, 1987Based on data from 347. - 520. K. See also Stull, 1947.; AC

Antoine Equation Parameters

log10(P) = A − (B / (T + C))
    P = vapor pressure (bar)
    T = temperature (K)

View plot Requires a JavaScript / HTML 5 canvas capable browser.

Temperature (K) A B C Reference Comment
347.3 - 519.85.07422409.068-44.406Stull, 1947Coefficents calculated by NIST from author's data.

In addition to the Thermodynamics Research Center (TRC) data available from this site, much more physical and chemical property data is available from the following TRC products:

Kovats' RI, non-polar column, isothermal

View large format table.

Column type Active phase Temperature (C) I Reference Comment
CapillarySF-96170.1302.Kepner, Ellison, et al., 1974Column length: 152. m; Column diameter: 0.8 mm

Kovats' RI, non-polar column, temperature ramp

View large format table.

Column type Active phase I Reference Comment
CapillaryDB-51289.Lucero, Fredrickson, et al., 200630. m/0.25 mm/0.25 μm, He, 3. K/min; Tstart: 60. C
CapillaryHP-5MS1291.Asuming, Beauchamp, et al., 200530. m/0.25 mm/0.25 μm, He, 50. C @ 10. min, 3. K/min, 250. C @ 5. min
CapillarySPB-11275.Behera, Nagarajan, et al., 200430. m/0.32 mm/0.25 μm, He, 50. C @ 2. min, 2. K/min, 250. C @ 5. min
CapillaryCP Sil 8 CB1265.Schwob, Bessiere, et al., 200430. m/0.25 mm/0.25 μm, H2, 50. C @ 2. min, 3. K/min; Tend: 220. C
CapillaryDB-51287.Lucero, Estell, et al., 200330. m/0.25 mm/0.25 μm, He, 3. K/min; Tstart: 60. C
CapillaryDB-51308.El-Ghorab, Fadel, et al., 200225. m/0.22 mm/0.25 μm, He, 3. K/min; Tstart: 60. C; Tend: 240. C
CapillaryDB-51287.Adams, 200030. m/0.26 mm/0.25 μm, He, 3. K/min; Tstart: 60. C; Tend: 246. C
CapillaryDB-51289.da Silva, Zoghbi, et al., 199930. m/0.25 mm/0.25 μm, He, 4. K/min; Tstart: 60. C; Tend: 240. C
CapillaryOV-1011275.Menut, Molangui, et al., 1995N2, 5. K/min; Column length: 25. m; Column diameter: 0.25 mm; Tstart: 50. C; Tend: 200. C

Kovats' RI, polar column, isothermal

View large format table.

Column type Active phase Temperature (C) I Reference Comment
CapillaryCarbowax 20M190.2113.Kepner, Ellison, et al., 1974Column length: 152. m; Column diameter: 0.8 mm

Van Den Dool and Kratz RI, non-polar column, temperature ramp

View large format table.

Column type Active phase I Reference Comment
CapillaryHP-5MS1290.Benkaci-Ali, Baaliouamer, et al., 200730. m/0.25 mm/0.25 μm, He, 60. C @ 8. min, 2. K/min, 250. C @ 30. min
CapillaryCP-Sil PONA GB1271.Cunicao, Lopes, et al., 2007100. m/0.25 mm/0.25 μm, He, 140. C @ 10. min, 5. K/min, 230. C @ 25. min
CapillaryDB-51287.Esmaeili, Nematollahi, et al., 200650. m/0.2 mm/0.32 μm, N2, 60. C @ 3. min, 5. K/min, 220. C @ 5. min
CapillaryRTX-11266.Cozzani, Muselli, et al., 200560. m/0.22 mm/0.25 μm, 2. K/min, 220. C @ 20. min; Tstart: 60. C
CapillarySPB-11260.Antunes, Sevinate-Pinto, et al., 200430. m/0.25 mm/0.25 μm, He, 3. K/min, 220. C @ 15. min; Tstart: 70. C
CapillaryHP-5MS1288.Salido, Valenzuela, et al., 200430. m/0.25 mm/0.25 μm, He, 3. K/min; Tstart: 50. C; Tend: 250. C
CapillaryHP-5MS1295.Lalel, Singh, et al., 200360. m/0.25 mm/0.25 μm, He, 40. C @ 1. min, 3. K/min, 310. C @ 20. min
CapillaryHP-51291.Tsiri, Kretsi, et al., 200330. m/0.25 mm/0.25 μm, He, 3. K/min; Tstart: 60. C; Tend: 280. C
CapillaryHP-51287.Couladis, Tsortanidou, et al., 200130. m/0.25 mm/0.25 μm, He, 3. K/min; Tstart: 60. C; Tend: 380. C
CapillaryHP-5MS1287.Giamakis, Kretsi, et al., 200130. m/0.25 mm/0.25 μm, He, 60. C @ 5. min, 3. K/min; Tend: 280. C
CapillaryHP-5MS1288.Salido, Altarejos, et al., 200130. m/0.25 mm/0.25 μm, He, 3. K/min; Tstart: 50. C; Tend: 250. C
CapillaryDB-51278.Sakho, Chassagne, et al., 1997H2, 60. C @ 3. min, 2. K/min; Column length: 30. m; Column diameter: 0.25 mm; Tend: 220. C
CapillaryMethyl Silicone1279.Píry, Príbela, et al., 199525. m/0.2 mm/0.3 μm, He, 2. K/min; Tstart: 40. C; Tend: 200. C
CapillaryDB-11270.Combariza, Tirado, et al., 199460. m/0.25 mm/0.25 μm, He, 70. C @ 5. min, 2.5 K/min, 250. C @ 15. min
CapillaryDB-11278.Adedeji, Hartman, et al., 199260. m/0.32 mm/0.25 μm, He, 40. C @ 3. min, 2. K/min, 280. C @ 10. min

Van Den Dool and Kratz RI, non-polar column, custom temperature program

View large format table.

Column type Active phase I Reference Comment
CapillaryHP-5MS1283.Pérez, Navarro, et al., 200730. m/0.25 mm/0.25 μm, He; Program: 50C(4min) => 10C/min => 200C(0.5min) => 20C/min => 260C(5min)
CapillarySE-521287.Frizzo, Lorenzo, et al., 200425. m/0.32 mm/0.43 μm, H2; Program: 60C(8min) => 3C/min => 180C => 20C/min => 250C(10min)
CapillarySE-521294.Mondello, Dugo, et al., 199560. m/0.32 mm/0.40 μm, He; Program: 45 C (6 min) 3 C/min -> 111 0C 2 C/min -> 160 C 3 C/min -> 300 C (15 min)

Van Den Dool and Kratz RI, polar column, temperature ramp

View large format table.

Column type Active phase I Reference Comment
CapillaryRTX-Wax2086.Cozzani, Muselli, et al., 200560. m/0.22 mm/0.25 μm, 2. K/min, 220. C @ 20. min; Tstart: 60. C
CapillaryDB-Wax2090.Chyau, Ko, et al., 200360. m/0.25 mm/0.25 μm, He, 2. K/min, 210. C @ 40. min; Tstart: 40. C
CapillaryCarbowax 20M2078.Mondello, Dugo, et al., 199560. m/0.32 mm/0.425 μm, He, 45. C @ 3. min, 3. K/min, 300. C @ 20. min

Normal alkane RI, non-polar column, temperature ramp

View large format table.

Column type Active phase I Reference Comment
CapillaryHP-5 MS1295.Zouari, Ayadi, et al., 201230. m/0.25 mm/0.25 μm, Helium, 50. C @ 1. min, 7. K/min, 250. C @ 5. min
CapillaryDB-11265.Mirjalili, Salehi, et al., 201025. m/0.25 mm/0.25 μm, Nitrogen, 60. C @ 1. min, 4. K/min, 250. C @ 10. min
CapillaryDB-51289.El-Ghorab A., El-Massry K.F., et al., 200730. m/0.25 mm/0.25 μm, He, 3. K/min, 220. C @ 40. min; Tstart: 35. C
CapillaryZB-51298.Mohottalage, Tabacchi, et al., 200730. m/0.25 mm/0.25 μm, 60. C @ 5. min, 4. K/min, 220. C @ 20. min
CapillaryHP-5 MS1291.Vagionas, Graikou, et al., 200730. m/0.25 mm/0.25 μm, Helium, 3. K/min; Tstart: 60. C; Tend: 280. C
CapillaryHP-51295.Figuérédo, Cabassu, et al., 200630. m/0.25 mm/0.25 μm, He, 50. C @ 5. min, 5. K/min, 300. C @ 5. min
CapillaryDB-51293.Morteza-Semnani, Akbarzadeh, et al., 200630. m/0.25 mm/0.25 μm, He, 4. K/min; Tstart: 60. C; Tend: 220. C
CapillaryHP-51296.Wang, Yang, et al., 200630. m/0.25 mm/0.25 μm, He, 60. C @ 2. min, 10. K/min, 250. C @ 10. min
CapillaryDB-51288.Bos, Stojanova, et al., 200530. m/0.249 mm/0.25 μm, He, 3. K/min; Tstart: 60. C; Tend: 290. C
CapillaryHP-51295.Figuérédo, Cabassu, et al., 200530. m/0.25 mm/0.25 μm, He, 50. C @ 5. min, 5. K/min, 300. C @ 5. min
CapillaryRSL-2001284.Jirovetz, Buchbauer, et al., 200530. m/0.25 mm/0.25 μm, 40. C @ 2. min, 6. K/min, 280. C @ 10. min
CapillaryHP-5MS1267.Pourmortazavi, Ghadiri, et al., 200530. m/0.25 mm/0.32 μm, He, 60. C @ 3. min, 5. K/min; Tend: 250. C
CapillaryHP-5MS1292.Sajjadi and Ghannadi, 200530. m/0.25 mm/0.25 μm, He, 4. K/min; Tstart: 60. C; Tend: 275. C
CapillaryDB-51287.Skoula and Grayer, 200530. m/0.25 mm/0.25 μm, He, 3. K/min, 230. C @ 20. min; Tstart: 60. C
CapillaryDB-51290.JAvidnia, Mojab, et al., 200425. m/0.25 mm/0.25 μm, Nitrogen, 3. K/min; Tstart: 60. C; Tend: 240. C
CapillaryRTX-11267.Kalemba and Thiem, 200430. m/0.25 mm/0.25 μm, N2, 4. K/min; Tstart: 60. C; Tend: 300. C
CapillarySE-541290.Kilic, Hafizoglu, et al., 200430. m/0.25 mm/0.25 μm, He, 60. C @ 5. min, 2. K/min; Tend: 260. C
CapillaryHP-5MS1283.Li and Jiang, 200430. m/0.25 mm/0.25 μm, He, 50. C @ 2. min, 5. K/min, 230. C @ 10. min
CapillaryDB-51286.Tellez, Khan, et al., 200430. m/0.25 mm/0.25 μm, He, 3. K/min; Tstart: 60. C; Tend: 240. C
CapillaryDB-51287.Pino, Marbot, et al., 200330. m/0.25 mm/0.25 μm, H2, 60. C @ 10. min, 4. K/min, 280. C @ 40. min
CapillaryHP-51270.Pitarokili, Tzakou, et al., 200330. m/0.25 mm/0.25 μm, He, 3. K/min; Tstart: 60. C; Tend: 280. C
CapillarySE-301286.Iñigo, Palá-Paúl, et al., 200250. m/0.25 mm/0.25 μm, He, 4. K/min; Tstart: 70. C; Tend: 240. C
CapillaryRSL-2001284.Jirovetz, Buchbauer, et al., 200230. m/0.32 mm/0.25 μm, H2, 40. C @ 5. min, 6. K/min, 280. C @ 5. min
CapillaryRSL-2001284.Jirovetz, Smith, et al., 200230. m/0.25 mm/0.25 μm, H2, 40. C @ 2. min, 6. K/min, 280. C @ 10. min
CapillaryDB-11252.Palá-Paúl, Pérez-Alonso, et al., 200250. m/0.25 mm/0.25 μm, N2, 4. K/min; Tstart: 80. C; Tend: 225. C
CapillaryDB-5MS1305.Zoghbi, Andrade, et al., 200230. m/0.25 mm/0.25 μm, He, 3. K/min; Tstart: 60. C; Tend: 270. C
CapillaryRTX-11273.Kalemba, Marschall, et al., 200130. m/0.25 mm/0.25 μm, N2, 4. K/min; Tstart: 60. C; Tend: 300. C
CapillaryPTE-51287.Stojanovic, Palic, et al., 200160. m/0.32 mm/0.3 μm, H2, 4.3 K/min; Tstart: 60. C; Tend: 285. C
CapillaryOV-1011268.Menon, Chacko, et al., 1999N2, 1. K/min, 200. C @ 20. min; Column length: 50. m; Column diameter: 0.2 mm; Tstart: 80. C
CapillaryCP Sil 5 CB1267.Weyerstahl, Marschall, et al., 1999N2, 5. K/min; Column length: 25. m; Phase thickness: 0.39 μm; Tstart: 60. C; Tend: 220. C
CapillaryDB-11260.Salgueiro, Vila, et al., 19976. K/min; Tstart: 80. C; Tend: 220. C

Normal alkane RI, non-polar column, custom temperature program

View large format table.

Column type Active phase I Reference Comment
CapillaryDB-11265.Albano, Lima, et al., 201230. m/0.25 mm/0.25 μm, Hydrogen; Program: 45 0C 3 0C/min -> 175 0C 15 0C/min -> 300 0C (10 min)
CapillaryPolydimethyl siloxane with 5 % Ph groups1295.Robinson, Adams, et al., 2012Program: not specified
CapillaryPolydimethyl siloxane with 5 % Ph groups1306.Robinson, Adams, et al., 2012Program: not specified
CapillaryHP-5 MS1288.Chu, Liu, et al., 201130. m/0.25 mm/0.25 μm, Helium; Program: 60 0C (1 min) 10 0C -> 180 0C (1 min) 20 0C/min -> 280 0C (15 min)
CapillaryHP-5 MS1289.Payo, Colo, et al., 2011Program: not specified
CapillaryHP-5 MS1289.Payo, Colo, et al., 2011Program: not specified
CapillaryHP-5 MS1265.Sharifiar, Yassa, et al., 201030. m/0.25 mm/0.25 μm, Helium; Program: 50 0C (3 min) 3 0C/min -> 160 0C (10 min) 3 0C/min -> 240 0C
CapillaryDB-51291.Nivinsliene, Butkiene, et al., 200750. m/0.32 mm/0.25 μm, Helium; Program: 60 0C (1 min) 5 0C/min -> 160 0C 10 0C/min -> 250 0C
CapillaryHP-5MS1293.Singh, Marimuthu, et al., 200630. m/0.25 mm/0.25 μm, He; Program: 60C => 1.5C/min => 185C(1min) => 9C/min => 275C(2min)
CapillaryDB-11260.Belhattab, Larous, et al., 200530. m/0.25 mm/0.25 μm, He; Program: 45C => 3C/min => 175C => 15C/min => 300C(10min)
CapillaryCP Sil 8 CB1291.Butkienë, Nivinskienë, et al., 200550. m/0.32 mm/0.25 μm, He; Program: 50C(5min) => 2C/min => 90C => 15C/min => 240C(4min)
CapillaryDB-51276.Hamm, Bleton, et al., 200530. m/0.25 mm/0.25 μm, He; Program: 40C(1min) => 9C/min => 130C => 2C/min => 230C
CapillaryCP Sil 8 CB1291.Butkienë, Nivinskienë, et al., 200450. m/0.32 mm/0.25 μm, He; Program: 50C(5min) => 2C/min => 90C => 15C/min => 240C(4min)
CapillarySE-301279.Vinogradov, 2004Program: not specified
CapillarySE-301283.Vinogradov, 2004Program: not specified
CapillaryDB-51276.Hamm, Lesellier, et al., 200330. m/0.25 mm/0.25 μm, He; Program: 40C (1min) => 9C/min => 130C => 2C/min => 230C
CapillaryCP Sil 8 CB1287.Mockute, Nivinskiene, et al., 200350. m/0.32 mm/0.25 μm, He; Program: 60C(1min) => 5C/min => 160C => 10C/min => 250C(5min)
CapillaryAT-51287.Usai, Atzei, et al., 200360. m/0.25 mm/0.25 μm, He; Program: 50 0C 5 0C/min -> 135 0C (1 min) 5 0C/min -> 225 0C (5 min) 5 0C/min -> 260 0C
CapillaryCP Sil 5 CB1265.Weyerstahl, Marschall, et al., 1999, 2Column length: 25. m; Column diameter: 0.39 mm; Program: not specified
CapillaryCP Sil 5 CB1263.Weyerstahl, Marschall, et al., 1998He; Column length: 25. m; Phase thickness: 0.39 μm; Program: not specified
CapillaryCP Sil 5 CB1274.Weyerstahl, Marschall, et al., 1998, 2N2; Column length: 25. m; Phase thickness: 0.39 μm; Program: not specified
CapillaryDB-11260.Gaspar, Palma, et al., 199730. m/0.25 mm/0.25 μm, He; Program: 45C => 3C/min => 175C => 15C/min => 280C
CapillaryPolydimethyl siloxanes1279.Zenkevich, 1997Program: not specified
PackedOV-1011270.Swigar and Silverstein, 1981N2, Chromosorb G 60-80mesh DMCS; Column length: 2.5 m; Program: not specified

Normal alkane RI, polar column, temperature ramp

View large format table.

Column type Active phase I Reference Comment
CapillaryCP Wax 52 CB2078.Chen, Chyau, et al., 200760. m/0.25 mm/0.25 μm, Helium, 3. K/min; Tstart: 40. C; Tend: 220. C
CapillaryCP-Wax 52CB2106.Chyau, Tsai, et al., 200760. m/0.25 mm/0.25 μm, He, 3. K/min; Tstart: 40. C; Tend: 220. C
CapillaryHP-Innowax2095.Hachicha, Skanji, et al., 200730. m/0.25 mm/0.25 μm, He, 2. K/min, 240. C @ 20. min; Tstart: 60. C
CapillaryTC-FFAP2114.Kurose, Okamura, et al., 2007He, 3. K/min, 220. C @ 30. min; Column diameter: 0.25 mm; Phase thickness: 0.25 μm; Tstart: 60. C
CapillaryTC-FFAP2114.Kurose, Okamura, et al., 2007He, 3. K/min, 220. C @ 30. min; Column diameter: 0.25 mm; Phase thickness: 0.25 μm; Tstart: 60. C
CapillaryCP-Wax2076.Ka, Choi, et al., 200530. m/0.32 mm/0.25 μm, He, 40. C @ 2. min, 5. K/min; Tend: 180. C
CapillaryDB-Wax2098.Lee, Umano, et al., 200530. m/0.25 mm/0.25 μm, He, 3. K/min, 180. C @ 40. min; Tstart: 50. C
CapillaryDB-Wax2101.Jiang and Kubota, 2004He, 60. C @ 4. min, 2. K/min; Column length: 60. m; Column diameter: 0.25 mm; Tend: 220. C
CapillaryDB-Wax2097.Lin, Cai, et al., 200330. m/0.25 mm/0.25 μm, He, 50. C @ 2. min, 3. K/min, 230. C @ 20. min
CapillaryTC-Wax2088.Miyazawa, Yamafuji, et al., 20033. K/min; Column length: 60. m; Column diameter: 0.25 mm; Tstart: 80. C; Tend: 240. C
CapillaryInnowax2113.Suleimenov, Atazharova, et al., 2003He, 60. C @ 10. min, 4. K/min, 220. C @ 10. min; Column length: 60. m; Column diameter: 0.25 mm
CapillaryInnowax2113.Kaya, Baser, et al., 199960. m/0.25 mm/0.25 μm, He, 60. C @ 10. min; Tend: 220. C
CapillaryHP-Innowax2113.Kaya, Baser, et al., 1999, 260. m/0.25 mm/0.25 μm, He, 60. C @ 10. min; Tend: 220. C
CapillaryHP-Innowax2113.Kaya, Baser, et al., 1999, 260. m/0.25 mm/0.25 μm, He, 60. C @ 10. min; Tend: 220. C
CapillaryDB-Wax2108.Weyerstahl, Marschall, et al., 1999N2, 5. K/min; Column length: 60. m; Phase thickness: 0.25 μm; Tstart: 60. C; Tend: 220. C

Normal alkane RI, polar column, custom temperature program

View large format table.

Column type Active phase I Reference Comment
CapillaryHP Innowax2115.Noorizadeh and Farmany, 201060. m/0.25 mm/0.33 μm; Program: not specified
CapillaryInnowax FSC2113.Polatoglu, Demirci, et al., 201060. m/0.25 mm/0.25 μm, Helium; Program: 60 0C (10 min) 4 0C/min -> 220 0C (10 min) 1 0C/min -> 240 0C
CapillaryInnowax FSC2113.Baser, Demirci, et al., 200960. m/0.25 mm/0.25 μm, Helium; Program: 60 0C (10 min) 4 0C/min -> 220 0C (10 min) 1 0C/min -> 240 0C
CapillaryHP Innowax FSP2113.Tabanca N., Demirci B., et al., 200760. m/0.25 mm/0.25 μm, N2; Program: 60C(10min) => 4C/min => 220C(10min) => 1C/min => 240C
CapillaryInnowax FSC2113.Baser K.H.C., Ozek G., et al., 200660. m/0.25 mm/0.25 μm, He; Program: 60C(10min) => 4C/min => 220C (10min) => 1C/min => 240C
CapillaryHP-Innowax FSC2113.Demirci B., Baser K.H.C., et al., 200660. m/0.25 mm/0.25 μm, N2; Program: 60C(10min) => 4C/min => 220C(10min) => 1C/min => 240C
CapillaryHP-Innowax FSC2113.Kürkçüoglu, Hüsnü Can Baser, et al., 200660. m/0.25 mm/0.25 μm, He; Program: 60C(10min) => 4C/min => 220C (10min) => 1C/min => 240C
CapillaryHP-Innowax FSC2113.Suleimenov Y.M., Atazhanova G.A., et al., 200660. m/0.25 mm/0.25 μm, He; Program: 60(10min) => 4C/min => 220C(10min) => 1C/min => 240C
CapillaryHP-Innowax FSC2113.Tabanca, Demirci, et al., 200660. m/0.25 mm/0.25 μm, N2; Program: 60C(10min) => 4C/min => 220C => (10min) => 1C/min => 240C
CapillaryHP-Innowax FSC2113.Demirci, Paper, et al., 200460. m/0.25 mm/0.25 μm, He; Program: 60C(10min) => 4C/min => 220C(10min) => 1C/min => 240C
CapillaryInnowax FSC2113.Baser, Demirci, et al., 200360. m/0.25 mm/0.25 μm, He; Program: 60C(10min) => 4C/min => 220C (10min) => 1C/min => 240C
CapillaryHP-Innowax FSC2113.Demirci, Baser, et al., 200360. m/0.25 mm/0.25 μm, He; Program: 60C (10min) => 4C/min => 220C (10min) => 1C/min => 240C
CapillaryHP-Innowax2113.Viljoen, van Vuuren, et al., 200360. m/0.25 mm/0.25 μm; Program: 60C(10min) => 4C/min => 220C(10min) => 1C/min => 240C
CapillaryHP-Innowax2113.Baser, Demirci, et al., 200260. m/0.25 mm/0.25 μm, He; Program: 60 0C (10 min) 4 K/min -> 220 0C (10 min) 1 K/min -> 240 0C
CapillaryInnowax2113.Baser, Nuriddinov, et al., 200260. m/0.25 mm/0.25 μm, He; Program: 60C(10min) => 4C/min => 220C(10min) => 1C/min => 240C
CapillaryInnowax FSC2113.Tunalier, Kirimer, et al., 200260. m/0.25 mm/0.25 μm; Program: 60C(10min) => 4C/min => 220C(10min) => 1C/min => 240C
CapillaryHP-Innowax2113.Baser, Demirci, et al., 200160. m/0.25 mm/0.25 μm, He; Program: 60 0C (10 min) 10 K/min -> 220 0C (10 min) 1K/min -> 240 0C
CapillaryHP-Innowax2113.Gören, Demirci, et al., 200160. m/0.25 mm/0.25 μm, He; Program: 60 0C (10 min) 4 K/min -> 220 0C (10 min) 1 K/min -> 240 0C
CapillaryInnowax2113.Özcan, Akgül, et al., 200160. m/0.25 mm/0.25 μm, He; Program: 60C(10min) => 4C/min => 200C(10min) => 1C/min => 240C
CapillaryHP-Innowax2113.Tabanca, Kirimer, et al., 200160. m/0.25 mm/0.25 μm, He; Program: 60C(10min) => 4C/min => 220C(10min) => 1C/min => 240C
CapillaryInnowax2113.Baser, Özek, et al., 200060. m/0.25 mm/0.25 μm, He; Program: 60 0C (10 min) 4 K/min -> 220 0C (10 min) 1 K/min -> 240 0C
CapillaryInnowax2113.Baser, Kürkcüoglu, et al., 199860. m/0.25 mm/0.25 μm; Program: 60C(10min) => 4C/min => 220C(10min) => 1C/min => 240C
CapillaryFFAP2110.Reddy, Angers, et al., 199825. m/0.2 mm/0.33 μm, H2; Program: 40C(5min) => 4C/min => 170C => 8C/min => 240C (12min)
CapillaryDB-Wax2104.Weyerstahl, Marschall, et al., 1998N2; Column length: 60. m; Phase thickness: 0.25 μm; Program: not specified
CapillaryDB-Wax2099.Weyerstahl, Marschall, et al., 1998, 2N2; Column length: 60. m; Phase thickness: 0.25 μm; Program: not specified

References

Perkin, 1896
Perkin, W.H., LXIX. On Magnetic Rotatory Power, especially of Aromatic Compounds, J. Chem. Soc., 1896, 69, 1025-1257. [all data]

Kahlbaum, 1884
Kahlbaum, G.W.A., The dependence of Boiling Temperature on Air Pressure, Ber. Dtsch. Chem. Ges., 1884, 17, 1245. [all data]

Aldrich Chemical Company Inc., 1990
Aldrich Chemical Company Inc., Catalog Handbook of Fine Chemicals, Aldrich Chemical Company, Inc., Milwaukee WI, 1990, 1. [all data]

Stephenson and Malanowski, 1987
Stephenson, Richard M.; Malanowski, Stanislaw, Handbook of the Thermodynamics of Organic Compounds, 1987, https://doi.org/10.1007/978-94-009-3173-2 . [all data]

Stull, 1947
Stull, Daniel R., Vapor Pressure of Pure Substances. Organic and Inorganic Compounds, Ind. Eng. Chem., 1947, 39, 4, 517-540, https://doi.org/10.1021/ie50448a022 . [all data]

Kepner, Ellison, et al., 1974
Kepner, R.E.; Ellison, B.O.; Breckenridge, M.; Connolly, G.; Madden, S.C.; Muller, C.J., Volatile terpenes in California Bay foliage. Changes in composition during maturation, J. Agric. Food Chem., 1974, 22, 5, 781-784, https://doi.org/10.1021/jf60195a027 . [all data]

Lucero, Fredrickson, et al., 2006
Lucero, M.E.; Fredrickson, E.L.; Estell, R.E.; Morrison, A.A.; Richman, D.B., Volatile Composition of Gutierrezia sarothrae (Broom Snakeweed) as Determined by Steam Distillation and Solid Phase Microextraction, J. Essent. Oil Res., 2006, 18, 2, 121-125, https://doi.org/10.1080/10412905.2006.9699039 . [all data]

Asuming, Beauchamp, et al., 2005
Asuming, W.A.; Beauchamp, P.S.; Descalzo, J.T.; Dev, B.C.; Dev, V.; Frost, S.; Ma, C.W., Essential oil composition of four Lomatium Raf. species and their chemotaxonomy, Biochem. Syst. Ecol., 2005, 33, 1, 17-26, https://doi.org/10.1016/j.bse.2004.06.005 . [all data]

Behera, Nagarajan, et al., 2004
Behera, S.; Nagarajan, S.; Rao, L.J.M., Microwave heating and conventional roasting of cumin seeds (Cuminum cyminum L.) and effect on chemical composition of volatiles, Food Chem., 2004, 87, 1, 25-29, https://doi.org/10.1016/j.foodchem.2003.10.012 . [all data]

Schwob, Bessiere, et al., 2004
Schwob, I.; Bessiere, J.-M.; Masotti, V.; Viano, J., Changes in essential oil composition in Saint John's wort (Hypericum perforatum L.) aerial parts during its phenological cycle, Biochem. Syst. Ecol., 2004, 32, 8, 735-745, https://doi.org/10.1016/j.bse.2003.12.005 . [all data]

Lucero, Estell, et al., 2003
Lucero, M.E.; Estell, R.E.; Frederickson, E.L., The essential oil composition of Psorothamnus scoparius (A. Gray) Rydb., J. Essent. Oil Res., 2003, 15, 2, 108-111, https://doi.org/10.1080/10412905.2003.9712083 . [all data]

El-Ghorab, Fadel, et al., 2002
El-Ghorab, A.H.; Fadel, H.M.; El-Massry, K.F., The Egyptian Eucalyptus camaldulensis var. brevirostris: chemical compositions of the fruit volatile oil and antioxidant activity, Flavour Fragr. J., 2002, 17, 4, 306-312, https://doi.org/10.1002/ffj.1085 . [all data]

Adams, 2000
Adams, R.P., The serrate leaf margined Juniperus (Section Sabina) of the western hemisphere: systematics and evolution based on leaf essential oils and Random Amplified Polymorphic DNAs (RAPDs), Biochem. Syst. Ecol., 2000, 28, 10, 975-989, https://doi.org/10.1016/S0305-1978(00)00022-3 . [all data]

da Silva, Zoghbi, et al., 1999
da Silva, M.H.L.; Zoghbi, M.G.B.; Andrade, E.H.A.; Maia, J.G.S., The essential oils of Peperomia pellucida Kunth and P. circinnata link var. circinnata, Flavour Fragr. J., 1999, 14, 5, 312-314, https://doi.org/10.1002/(SICI)1099-1026(199909/10)14:5<312::AID-FFJ835>3.0.CO;2-B . [all data]

Menut, Molangui, et al., 1995
Menut, C.; Molangui, T.; Lamaty, G.E.; Bessière, J.-M.; Habimana, J.-B. Menut.; Molangui, T.; Lamaty, G.E.; Bessière, J.-M.; Habimana, J.-B., Aromatic plants of tropical Central Africa. 23. Chemical composition of leaf essential oils of Eucalyptus goniocalyx F. Muell. and Eucalyptus patens Benth. grown in Rwanda, J. Agric. Food Chem., 1995, 43, 5, 1267-1271, https://doi.org/10.1021/jf00053a026 . [all data]

Benkaci-Ali, Baaliouamer, et al., 2007
Benkaci-Ali, F.; Baaliouamer, A.; Meklati, B.Y.; Chemat, F., Chemical composition of seed essential oils from Algerian Nigella sativa extracted by microwave and hydrodistillation, Flavour Fragr. J., 2007, 22, 2, 148-153, https://doi.org/10.1002/ffj.1773 . [all data]

Cunicao, Lopes, et al., 2007
Cunicao, M.M.; Lopes, A.R.; Côcco, L.C.; Yamamoto, C.I.; Plocharski, R.C.B.; Miguel, M.D.; Junior, A.G.; Auer, C.G.; Miguel, O.G., Phytochemical and antibacterial evaluation of essential oils from Ottonia Martiana Miq. (Piperaceae), J. Braz. Chem. Soc., 2007, 18, 1, 184-188, https://doi.org/10.1590/S0103-50532007000100021 . [all data]

Esmaeili, Nematollahi, et al., 2006
Esmaeili, A.; Nematollahi, F.; Rustaiyan, A.; Moazami, N.; Masoudi, S.; Bamasian, S., Volatile constituents of Achillea pachycephala, A. oxyodonta and A. biebersteinii from Iran, Flavour Fragr. J., 2006, 21, 2, 253-256, https://doi.org/10.1002/ffj.1571 . [all data]

Cozzani, Muselli, et al., 2005
Cozzani, S.; Muselli, A.; Desjobert, J.-M.; Bernardini, A.-F.; Tomi, F.; Casanova, J., Chemical composition of essential oil of Teucrium polium subsp. capitatum (L.) from Corsica, Flavour Fragr. J., 2005, 20, 4, 436-441, https://doi.org/10.1002/ffj.1463 . [all data]

Antunes, Sevinate-Pinto, et al., 2004
Antunes, T.; Sevinate-Pinto, I.; Barroso, J.G.; Cavaleiro, C.; Salgueiro, L.R., Micromorphology of trichomes and composition of essential oil of Teucrium capitatum, Flavour Fragr. J., 2004, 19, 4, 336-340, https://doi.org/10.1002/ffj.1310 . [all data]

Salido, Valenzuela, et al., 2004
Salido, S.; Valenzuela, L.R.; Altarejos, J.; Nogueras, M.; Sánchez, A.; Cano, E., Composition and infraspecific variability of Artemisia herba-alba from southern Spain, Biochem. Syst. Ecol., 2004, 32, 3, 265-277, https://doi.org/10.1016/j.bse.2003.09.002 . [all data]

Lalel, Singh, et al., 2003
Lalel, H.J.D.; Singh, Z.; Chye Tan, S., Glycosidically-bound aroma volatile compounds in the skin and pulp of 'Kensington Pride' mango fruit at different stages of maturity, Postharvest Biol. Technol., 2003, 29, 2, 205-218, https://doi.org/10.1016/S0925-5214(02)00250-8 . [all data]

Tsiri, Kretsi, et al., 2003
Tsiri, D.; Kretsi, O.; Chinou, I.B.; Spyropoulos, C.G., Composition of fruit volatiles and annual changes in the volatiles of leaves of Eucalyptus camaldulensis Dehn. growing in Greece, Flavour Fragr. J., 2003, 18, 3, 244-247, https://doi.org/10.1002/ffj.1220 . [all data]

Couladis, Tsortanidou, et al., 2001
Couladis, M.; Tsortanidou, V.; Francisco-Ortega, J.; Santos-Guerra, A.; Harvala, C., Composition of the essential oils of Argyranthemum species growing in the Canary Islands, Flavour Fragr. J., 2001, 16, 2, 103-106, https://doi.org/10.1002/ffj.954 . [all data]

Giamakis, Kretsi, et al., 2001
Giamakis, A.; Kretsi, O.; Chinou, I.; Spyropoulos, C.G., Eucalyptus camaldulensis: volatiles from immature flowers and high production of 1,8-cineole and β-pinene by in vitro cultures, Phytochemistry, 2001, 58, 2, 351-355, https://doi.org/10.1016/S0031-9422(01)00193-5 . [all data]

Salido, Altarejos, et al., 2001
Salido, S.; Altarejos, J.; Nogueras, M.; Sánchez, A., Chemical composition of the essential oil of Artemisia herba-alba Asso ssp. valentina (Lam.) Marcl., J. Essent. Oil Res., 2001, 13, 4, 221-224, https://doi.org/10.1080/10412905.2001.9699675 . [all data]

Sakho, Chassagne, et al., 1997
Sakho, M.; Chassagne, D.; Crouzet, J., African mango glycosidically bound volatile compounds, J. Agric. Food Chem., 1997, 45, 3, 883-888, https://doi.org/10.1021/jf960277b . [all data]

Píry, Príbela, et al., 1995
Píry, J.; Príbela, A.; Durcanská, J.; Farkas, P., Fractionation of volatiles from blackcurrant (Ribes nigrum L.) by different extractive methods, Food Chem., 1995, 54, 1, 73-77, https://doi.org/10.1016/0308-8146(95)92665-7 . [all data]

Combariza, Tirado, et al., 1994
Combariza, M.Y.; Tirado, C.B.; Stashenko, E.; Shibamoto, T., Limonene concentration in lemon (Citrus volkameriana) peel oil as a function of ripeness, J. Hi. Res. Chromatogr., 1994, 17, 9, 643-646, https://doi.org/10.1002/jhrc.1240170905 . [all data]

Adedeji, Hartman, et al., 1992
Adedeji, J.; Hartman, T.G.; Lech, J.; Ho, C.-T., Characterization of glycosidically bound aroma compounds in the African Mango (Mangifera indica L.), J. Agric. Food Chem., 1992, 40, 4, 659-661, https://doi.org/10.1021/jf00016a028 . [all data]

Pérez, Navarro, et al., 2007
Pérez, R.A.; Navarro, T.; de Lorenzo, C., HS-SPME analysis of the volatile compounds from spices as a source of flavour in 'Campo Real' table olive preparations, Flavour Fragr. J., 2007, 22, 4, 265-273, https://doi.org/10.1002/ffj.1791 . [all data]

Frizzo, Lorenzo, et al., 2004
Frizzo, C.D.; Lorenzo, D.; Dellacassa, E., Composition and seasonal variation of the essential oils from two mandarin cultivars of Southern Brazil, J. Agric. Food Chem., 2004, 52, 10, 3036-3041, https://doi.org/10.1021/jf030685x . [all data]

Mondello, Dugo, et al., 1995
Mondello, L.; Dugo, P.; Basile, A.; Dugo, G., Interactive use of linear retention indices, on polar and apolar columns, with a MS-library for reliable identification of complex mixtures, J. Microcolumn Sep., 1995, 7, 6, 581-591, https://doi.org/10.1002/mcs.1220070605 . [all data]

Chyau, Ko, et al., 2003
Chyau, C.-C.; Ko, P.-T.; Chang, C.-H.; Mau, J.-L., Free and glycosidically bound aroma compounds in lychee (Litchi chinensis Sonn.), Food Chem., 2003, 80, 3, 387-392, https://doi.org/10.1016/S0308-8146(02)00278-9 . [all data]

Zouari, Ayadi, et al., 2012
Zouari, N.; Ayadi, I.; Fakhfakh, N.; Rebai, A.; Zouari, S., Variations of chemical composition of essential oils in wild-populations of Thymus algeriensis Boiss et Reut., a North African endemic species, Lipids in Health and Desease, 2012, 11, 1, 28-39, https://doi.org/10.1186/1476-511X-11-28 . [all data]

Mirjalili, Salehi, et al., 2010
Mirjalili, M.H.; Salehi, P.; Sonboli, A.; HAdian, J.; Ebrahimi, S.N.; Yousefzadi, M., The composition and antibacterial activity of the essential oil of Levisticum officinale Koch flowers and fruits at different developmental stages, J. Serb. Chem. Soc., 2010, 75, 12, 1661-1669, https://doi.org/10.2298/JSC100524126M . [all data]

El-Ghorab A., El-Massry K.F., et al., 2007
El-Ghorab A.; El-Massry K.F.; Shibamoto T., Chemical composition of the volatile extract and antioxidant activities of the volatile and nonvolatile extracts of Egyptian corn silk (Zea mays L.), J. Agric. Food Chem., 2007, 55, 22, 9124-9127, https://doi.org/10.1021/jf071646e . [all data]

Mohottalage, Tabacchi, et al., 2007
Mohottalage, S.; Tabacchi, R.; Guerin, P.M., Components from Sri Lankan Piper betle L. leaf oil and their analogues showing toxicity against the housefly, Musca domestica, Flavour Fragr. J., 2007, 22, 2, 130-138, https://doi.org/10.1002/ffj.1770 . [all data]

Vagionas, Graikou, et al., 2007
Vagionas, K.; Graikou, K.; Ngassapa, O.; Runyoro, D.; Chinou, I., Composition and antimicrobial activity of the essential oils of three Satureja species growing in Tansania, Food Chem., 2007, 103, 2, 319-324, https://doi.org/10.1016/j.foodchem.2006.07.051 . [all data]

Figuérédo, Cabassu, et al., 2006
Figuérédo, G.; Cabassu, P.; Chalchat, J.-C.; Pasquier, B., Studies of Mediterranean oregano populations. VIII. Chemical composition of essential oils of oreganos of various origins, Flavour Fragr. J., 2006, 21, 1, 134-139, https://doi.org/10.1002/ffj.1543 . [all data]

Morteza-Semnani, Akbarzadeh, et al., 2006
Morteza-Semnani, K.; Akbarzadeh, M.; Changizi, S., Essential oils composition of Stachys byzantina, S. inflata, S. lavandulifolia and S. laxa from Iran, Flavour Fragr. J., 2006, 21, 2, 300-303, https://doi.org/10.1002/ffj.1594 . [all data]

Wang, Yang, et al., 2006
Wang, Q.; Yang, Y.; Zhao, X.; Zhu, B.; Nan, P.; Zhao, J.; Wang, L.; Chen, F.; Liu, Z.; Zhong, Y., Chemical variation in the essential oil of Ephedra sinica from Northeastern China, Food Chem., 2006, 98, 1, 52-58, https://doi.org/10.1016/j.foodchem.2005.04.033 . [all data]

Bos, Stojanova, et al., 2005
Bos, R.; Stojanova, A.; Woerdenbag, H.J.; Koulman, A.; Quax, W.J., Volatile components of the aerial parts of Artemisia pontica L. grown in Bulgaria, Flavour Fragr. J., 2005, 20, 2, 145-148, https://doi.org/10.1002/ffj.1399 . [all data]

Figuérédo, Cabassu, et al., 2005
Figuérédo, G.; Cabassu, P.; Chalchat, J.-C.; Pasquier, B., Studies of Mediterranean oregano populations- V. Chemical composition of essential oils of oregano: Origanum syriacum L. var. bevanii (Holmes) Ietswaart, O. syriacum L. var. sinaicum (Boiss.) Ietswaart, and O. syriacum L. var. syriacum from Lebanon and Israel, Flavour Fragr. J., 2005, 20, 164-168. [all data]

Jirovetz, Buchbauer, et al., 2005
Jirovetz, L.; Buchbauer, G.; Stoyanova, A.; Georgiev, E.V.; Damianova, S.T., Composition, quality control and antimicrobial activity of the essential oil of cumin (Cuminum cyminumL.) seeds from Bulgaria that had been stored for up to 36 years, Int. J. Food Sci. Technol., 2005, 40, 3, 305-310, https://doi.org/10.1111/j.1365-2621.2004.00915.x . [all data]

Pourmortazavi, Ghadiri, et al., 2005
Pourmortazavi, S.M.; Ghadiri, M.; Hajimirsadeghi, S.S., Supercritical fluid extraction of volatile components from Bunium persicum Boiss. (black cumin) and Mespilus germanica L. (medlar) seeds, J. Food Comp. Anal., 2005, 18, 5, 439-446, https://doi.org/10.1016/j.jfca.2004.01.003 . [all data]

Sajjadi and Ghannadi, 2005
Sajjadi, S.-E.; Ghannadi, A., Essential oil of the Persian sage, Salvia rhytidea Benth., Acta Pharm. Sin., 2005, 55, 321-326. [all data]

Skoula and Grayer, 2005
Skoula, M.; Grayer, R.J., Volatile oils of Coridothymus capitatus, Satureja thymbra, Satureja spinosa and Thymbra calostachya (Lamiaceae) from Crete, Flavour Fragr. J., 2005, 20, 6, 573-576, https://doi.org/10.1002/ffj.1489 . [all data]

JAvidnia, Mojab, et al., 2004
JAvidnia, K.; Mojab, F.; Mojahedi, S.A., Chemical constituents of the essential oil of Stachys lavandulifolia Vahl from Iran, Iranian J. Pharm. Res., 2004, 3, 61-63. [all data]

Kalemba and Thiem, 2004
Kalemba, D.; Thiem, B., Constituents of the essential oils of four micropropagated Solidago species, Flavour Fragr. J., 2004, 19, 1, 40-43, https://doi.org/10.1002/ffj.1271 . [all data]

Kilic, Hafizoglu, et al., 2004
Kilic, A.; Hafizoglu, H.; Kollmannsberger, H.; Nitz, S., Volatile constituents and key odorants in leaves, buds, flowers, and fruits of Laurus nobilis L., J. Agric. Food Chem., 2004, 52, 6, 1601-1606, https://doi.org/10.1021/jf0306237 . [all data]

Li and Jiang, 2004
Li, R.; Jiang, Z.-T., Chemical composition of the essential oil of Cuminum cyminum L. from China, Flavour Fragr. J., 2004, 19, 4, 311-313, https://doi.org/10.1002/ffj.1302 . [all data]

Tellez, Khan, et al., 2004
Tellez, M.R.; Khan, I.A.; Schaneberg, B.T.; Crockett, S.L.; Rimando, A.M.; Kobaisy, M., Steam distillation-solid-phase microextraction for the detection of Ephedra sinica in herbal preparations, J. Chromatogr. A, 2004, 1025, 1, 51-56, https://doi.org/10.1016/S0021-9673(03)01035-5 . [all data]

Pino, Marbot, et al., 2003
Pino, J.A.; Marbot, R.; Fuentes, V., Characterization of volatiles in Bullock's heart (Annona reticulata L.) fruit cultivars from Cuba, J. Agric. Food Chem., 2003, 51, 13, 3836-3839, https://doi.org/10.1021/jf020733y . [all data]

Pitarokili, Tzakou, et al., 2003
Pitarokili, D.; Tzakou, O.; Loukis, A.; Harvala, C., Volatile metabolites from Salvia fruticosa as antifungal agents in soilborne pathogens, J. Agric. Food Chem., 2003, 51, 11, 3294-3301, https://doi.org/10.1021/jf0211534 . [all data]

Iñigo, Palá-Paúl, et al., 2002
Iñigo, A.; Palá-Paúl, J.; Pérez-Alonso, M.J.; Velasco-Negueruela, A., Essential oil composition from the aerial parts of Haplophyllum linifolium (L.) G. Don fil., Botanica Complutensis, 2002, 26, 79-83. [all data]

Jirovetz, Buchbauer, et al., 2002
Jirovetz, L.; Buchbauer, G.; Ngassoum, M.B.; Geissler, M., Aroma compound analysis of Piper nigrum and Piper guineense essential oils from Cameroon using solid-phase microextraction-gas chromatography, solid-phase microextraction-gas chromatography-mass spectrometry and olfactometry, J. Chromatogr. A, 2002, 976, 1-2, 265-275, https://doi.org/10.1016/S0021-9673(02)00376-X . [all data]

Jirovetz, Smith, et al., 2002
Jirovetz, L.; Smith, D.; Buchbauer, G., Aroma compound analysis of Eruca sativa (Brassicaceae) SPME headspace leaf samples using GC, GC-MS, and olfactometry, J. Agric. Food Chem., 2002, 50, 16, 4643-4646, https://doi.org/10.1021/jf020129n . [all data]

Palá-Paúl, Pérez-Alonso, et al., 2002
Palá-Paúl, J.; Pérez-Alonso, M.J.; Velasco-Negueruela, A.; Sanz, J., Analysis by gas chromatography-mass spectrometry of the volatile components of Ageratina adenophora Spreng., growing in the Canary Islands, J. Chromatogr. A, 2002, 947, 2, 327-331, https://doi.org/10.1016/S0021-9673(02)00016-X . [all data]

Zoghbi, Andrade, et al., 2002
Zoghbi, M.G.B.; Andrade, E.H.A.; Maia, J.G.S., Volatile constituents from Adenocalymma alliaceum Miers and Petiveria alliacea L., two medicinal herbs of the Amazon, Flavour Fragr. J., 2002, 17, 2, 133-135, https://doi.org/10.1002/ffj.1051 . [all data]

Kalemba, Marschall, et al., 2001
Kalemba, D.; Marschall, H.; Bradesi, P., Constituents of the essential oil of Solidago gigantea Ait. (giant goldenrod), Flavour Fragr. J., 2001, 16, 1, 19-26, https://doi.org/10.1002/1099-1026(200101/02)16:1<19::AID-FFJ940>3.0.CO;2-U . [all data]

Stojanovic, Palic, et al., 2001
Stojanovic, G.; Palic, R.; Naskovic, T.; Dokovic, D.; Milosavljevic, S., Volatile constituents of Achillea lingulata W.K., J. Essent. Oil Res., 2001, 13, 5, 378-379, https://doi.org/10.1080/10412905.2001.9712239 . [all data]

Menon, Chacko, et al., 1999
Menon, A.N.; Chacko, S.; Narayanan, C.S., Free and glycosidically bound volatiles of cardamom (Eletteria cardamomum Maton var. miniscula Burkill), Flavour Fragr. J., 1999, 14, 1, 65-68, https://doi.org/10.1002/(SICI)1099-1026(199901/02)14:1<65::AID-FFJ789>3.0.CO;2-A . [all data]

Weyerstahl, Marschall, et al., 1999
Weyerstahl, P.; Marschall, H.; Thefeld, K.; Rustaiyan, A., Constituents of the essential oil of Tanacetum (syn. Chrysanthemum) fruticulosum Ledeb. from Iran, Flavour Fragr. J., 1999, 14, 2, 112-120, https://doi.org/10.1002/(SICI)1099-1026(199903/04)14:2<112::AID-FFJ786>3.0.CO;2-1 . [all data]

Salgueiro, Vila, et al., 1997
Salgueiro, L.R.; Vila, R.; Tomi, F.; Figueiredo, A.C.; Barroso, J.G.; Cañigueral, S.; Casanova, J.; da Cunha, A.P.; Adzet, T., Variability of essential oils of Thymus caespititius from Portugal, Phytochemistry, 1997, 45, 2, 307-311, https://doi.org/10.1016/S0031-9422(96)00872-2 . [all data]

Albano, Lima, et al., 2012
Albano, S.M.; Lima, A.S.; Miguel, M.G.; Pedro, L.G.; Barroso, J.G.; Figueiredo, A.C., Antioxidant, anti-5-lipoxygenase and antiacetylcholinesterase activities of essential oils and decoction water of some aromatic plants, Rec. Nat. Prod., 2012, 6, 1, 35-48. [all data]

Robinson, Adams, et al., 2012
Robinson, A.L.; Adams, D.O.; Boss, P.K.; Heymann, H.; Solomon, P.S.; Trengove, R.D., Influence of geographic origine on the sensory characteristics and wine composition of Vitus viniferas cv. Cabernet Sauvignon wines from Australia (Supplemental data), Am. J. Enol. Vitic., 2012, 64, 4, 467-476, https://doi.org/10.5344/ajev.2012.12023 . [all data]

Chu, Liu, et al., 2011
Chu, S.S.; Liu, S.L.; Liu, Q.Z.; Liu, Z.L.; Du, S.S., Composition and toxicity of Chinese Dracocephalum moldavica (Labiatae) essential oil against two grain storage insects, J. Med. Plants Res., 2011, 5, 21, 5262-5267. [all data]

Payo, Colo, et al., 2011
Payo, D.A.; Colo, J.; Calumpong, H.; de Clerck, O., Variability of non-polar secondary metabolites in the Red Alga Portieria, Mar Drugs, 2011, 9, 11, 2438-2468, https://doi.org/10.3390/md9112438 . [all data]

Sharifiar, Yassa, et al., 2010
Sharifiar, F.; Yassa, N.; Mozaffarian, V., Bioactivity of major components from the seeds of Bunium persicum (Boiss.) Fedtch, Pakistan J. Pharm. Sci., 2010, 23, 3, 300-304. [all data]

Nivinsliene, Butkiene, et al., 2007
Nivinsliene, O.; Butkiene, R.; Gudalevic, A.; Mockute, D.; Meskauskiene, V.; Grigaliunaite, B., Influence of urban environment on chemical composition of Tilia cordata essential oil, Chemija, 2007, 18, 1, 44-49. [all data]

Singh, Marimuthu, et al., 2006
Singh, G.; Marimuthu, P.; de Heluani, C.S.; Catalan, C.A.N., Antioxidant and biocidal activities of Carum nigrum (seed) essential oil, oleoresin, and their selected components, J. Agric. Food Chem., 2006, 54, 1, 174-181, https://doi.org/10.1021/jf0518610 . [all data]

Belhattab, Larous, et al., 2005
Belhattab, R.; Larous, L.; Figueiredo, A.C.; Santos, P.A.G.; Barroso, J.G.; Pedro, L.G., Origanum glandulosum Desf. grown wild in Algeria: essential oil composition and glycosidic bound volatiles, Flavour Fragr. J., 2005, 20, 2, 209-212, https://doi.org/10.1002/ffj.1387 . [all data]

Butkienë, Nivinskienë, et al., 2005
Butkienë, R.; Nivinskienë, O.; Mockutë, D., α-Pinene chemotype of leaf (needle) essential oils of Juniperus communis L. growing wild in Vilnius district, Chemija, 2005, 16, 1, 53-60. [all data]

Hamm, Bleton, et al., 2005
Hamm, S.; Bleton, J.; Connan, J.; Tchapla, A., A chemical investigation by headspace SPME and GC-MS of volatile and semi-volatile terpenes in various olibanum samples, Phytochemistry, 2005, 66, 12, 1499-1514, https://doi.org/10.1016/j.phytochem.2005.04.025 . [all data]

Butkienë, Nivinskienë, et al., 2004
Butkienë, R.; Nivinskienë, O.; Mockutë, D., Chemical composition of unripe and ripe berry essential oils of Juniperus communis L. growing wild in Vilnius district, Chemija, 2004, 15, 4, 57-63. [all data]

Vinogradov, 2004
Vinogradov, B.A., Production, composition, properties and application of essential oils, 2004, retrieved from http://viness.narod.ru. [all data]

Hamm, Lesellier, et al., 2003
Hamm, S.; Lesellier, E.; Bleton, J.; Tchapla, A., Optimization of headspace solid phase microextraction for gas chromatography/mass spectrometry analysis of widely different volatility and polarity terpenoids in olibanum, J. Chromatogr. A, 2003, 1018, 1, 73-83, https://doi.org/10.1016/j.chroma.2003.08.027 . [all data]

Mockute, Nivinskiene, et al., 2003
Mockute, D.; Nivinskiene, O.; Bernotiene, G.; Butkiene, R., The cis-thujone chemotype of Salvia officinalis L. essential oils, Chemija, 2003, 14, 4, 216-220. [all data]

Usai, Atzei, et al., 2003
Usai, M.; Atzei, A.; Pintore, G.; Casanova, I., Composition and variability of the essential oil of Sardinian Thymus herba-barona Loisel, Flavour Fragr. J., 2003, 18, 1, 21-25, https://doi.org/10.1002/ffj.1137 . [all data]

Weyerstahl, Marschall, et al., 1999, 2
Weyerstahl, P.; Marschall, H.; Splittgerber, U.; Son, P.T.; Giang, P.M.; Kaul, V.K., Constituents of the essential oil from the fruits of Zanthoxylum rhetsoides Drake from Vietnam and from the aerial parts of Zanthoxylum alatum Roxb. from India, Flavour Fragr. J., 1999, 14, 4, 225-229, https://doi.org/10.1002/(SICI)1099-1026(199907/08)14:4<225::AID-FFJ818>3.0.CO;2-1 . [all data]

Weyerstahl, Marschall, et al., 1998
Weyerstahl, P.; Marschall, H.; Weirauch, M.; Thefeld, K.; Surburg, H., Constituents of commercial Labdanum oil, Flavour Fragr. J., 1998, 13, 5, 295-318, https://doi.org/10.1002/(SICI)1099-1026(1998090)13:5<295::AID-FFJ751>3.0.CO;2-I . [all data]

Weyerstahl, Marschall, et al., 1998, 2
Weyerstahl, P.; Marschall, H.; Thefeld, K.; Subba, G.C., Constituents of the essential oil from the rhizomes of Hedychium gardnerianum Roscoe, Flavour Fragr. J., 1998, 13, 6, 377-388, https://doi.org/10.1002/(SICI)1099-1026(199811/12)13:6<377::AID-FFJ755>3.0.CO;2-F . [all data]

Gaspar, Palma, et al., 1997
Gaspar, H.; Palma, F.M.S.B.; de la Torre, M.C.; Rodríguez, B.; Barroso, J.G.; Figueiredo, A.C., Composition of the essential oil of Teucrium haenseleri Boiss., Flavour Fragr. J., 1997, 12, 5, 355-357, https://doi.org/10.1002/(SICI)1099-1026(199709/10)12:5<355::AID-FFJ656>3.0.CO;2-B . [all data]

Zenkevich, 1997
Zenkevich, I.G., Analytical Parameters of Components of Essential Oils for their Chromatographic and Chromato-Spectral Identificaiton. Oxsigenated derivatives of Mono- and Sesquiterpene Hydrocarbons, Rastit, Resursy (Rus.), 1997, 33, 1, 16-28. [all data]

Swigar and Silverstein, 1981
Swigar, A.A.; Silverstein, R.M., Monoterpenes, Aldrich Chemical Company, Milwaukee, WI, USA, 1981, 130. [all data]

Chen, Chyau, et al., 2007
Chen, C.-C.; Chyau, C.-C.; Hseu, TY.-H., Production of a COX-2 inhibitor, 2,4,5-trimethoxybenzaldehyde, with submerged cultured Antrodia camphorata, Lett. Appl. Microbiol., 2007, 44, 4, 387-392, https://doi.org/10.1111/j.1472-765X.2006.02087.x . [all data]

Chyau, Tsai, et al., 2007
Chyau, C.-C.; Tsai, S.-Y.; Yang, J.-H.; Weng, C.-C.; Han, C.-M.; Shih, C.-C.; Mau, J.-L., The essential oil of Glossogyne tenuifolia, Food Chem., 2007, 100, 2, 808-812, https://doi.org/10.1016/j.foodchem.2005.10.044 . [all data]

Hachicha, Skanji, et al., 2007
Hachicha, S.F.; Skanji, T.; Barrek, S.; Ghrabi, Z.G.; Zarrouk, H., Composition of the essential oil of Teucrium ramosissimum Desf. (Lamiaceae) from Tunisia, Flavour Fragr. J., 2007, 22, 2, 101-104, https://doi.org/10.1002/ffj.1764 . [all data]

Kurose, Okamura, et al., 2007
Kurose, K.; Okamura, D.; Yatagai, M., Composition of the essential oils from the leaves of nine Pinus species and the cones of three of Pinus species, Flavour Fragr. J., 2007, 22, 1, 10-20, https://doi.org/10.1002/ffj.1609 . [all data]

Ka, Choi, et al., 2005
Ka, M.-H.; Choi, E.H.; Chun, H.-S.; Lee, K.-G., Antioxidative Activity of Volatile Extracts Isolated from Angelica tenuissimae Roots, Peppermint Leaves, Pine Needles, and Sweet Flag Leaves, J. Agric. Food Chem., 2005, 53, 10, 4124-4129, https://doi.org/10.1021/jf047932x . [all data]

Lee, Umano, et al., 2005
Lee, S.-J.; Umano, K.; Shibamoto, T.; Lee, K.-G., Identification of volatile components in basil (Ocimum basilicum L.) and thyme leaves (Thymus vulgaris L.) and their antioxidant properties, Food Chem., 2005, 91, 1, 131-137, https://doi.org/10.1016/j.foodchem.2004.05.056 . [all data]

Jiang and Kubota, 2004
Jiang, L.; Kubota, K., Differences in the volatile components and their odor characteristics of green and ripe fruits and dried pericarp of Japanese pepper (Xanthoxylum piperitum DC.), J. Agric. Food Chem., 2004, 52, 13, 4197-4203, https://doi.org/10.1021/jf030663a . [all data]

Lin, Cai, et al., 2003
Lin, P.; Cai, J.; Li, J.; Sang, W.; Su, Q., Constituents of the essential oil of Hemerocallis flava day lily, Flavour Fragr. J., 2003, 18, 6, 539-541, https://doi.org/10.1002/ffj.1264 . [all data]

Miyazawa, Yamafuji, et al., 2003
Miyazawa, M.; Yamafuji, C.; Kurose, K.; Ishikawa, Y., Volatile components of the rhizomes of Cirsium japonicum DC, Flavour Fragr. J., 2003, 18, 1, 15-17, https://doi.org/10.1002/ffj.1135 . [all data]

Suleimenov, Atazharova, et al., 2003
Suleimenov, E.M.; Atazharova, G.A.; Demirchi, B.; Baser, K.H.C.; Adekenov, S.M., Essential oil composition of Artemisia Lercheana and A. Sieversiana of Kazakhstan flora in Recent problems of development of new medicines of natural origin, Proceedings of symposium, St.Petersburg - Pushkin, 2003, 382-385. [all data]

Kaya, Baser, et al., 1999
Kaya, A.; Baser, K.H.C.; Demirci, B.; Koca, F., The essential oil of Acinos alpinus (L.) Moench growing in Turkey, Flavour Fragr. J., 1999, 14, 1, 55-59, https://doi.org/10.1002/(SICI)1099-1026(199901/02)14:1<55::AID-FFJ784>3.0.CO;2-Q . [all data]

Kaya, Baser, et al., 1999, 2
Kaya, A.; Baser, K.H.C.; Tümen, G.; Koca, F., The essential oil of Acinos suaveolens (Sm.) G. Don fil. Acinos arvensis (Lam.) Dandy and Acinos rotundifolius Pers. growing wild in Turkey, Flavour Fragr. J., 1999, 14, 1, 60-64, https://doi.org/10.1002/(SICI)1099-1026(199901/02)14:1<60::AID-FFJ785>3.0.CO;2-0 . [all data]

Noorizadeh and Farmany, 2010
Noorizadeh, H.; Farmany, A., Exploration of linear and nonlinear modeling techniques to predict of retention index of essential oils, J. Chin. Chem. Soc., 2010, 1268-1277. [all data]

Polatoglu, Demirci, et al., 2010
Polatoglu, K.; Demirci, F.; Demirci, B.; Goren, N.; Baser, K.H.C., Antimicrobial activity and essential oil composition of a new T. argyrophyllum (C. Koch) Tvzel var. argyrophyllium chemotype, J. Oleo Sci., 2010, 59, 6, 307-313, https://doi.org/10.5650/jos.59.307 . [all data]

Baser, Demirci, et al., 2009
Baser, K.H.C.; Demirci, B.; Kurkcuoglu, M.; Satin, F.; Tumen, G., Comparative morphological and phytochemical charactertization of Salvia cadmica and S. smyrnaea, Pak. J. Bot., 2009, 41, 4, 1545-1555. [all data]

Tabanca N., Demirci B., et al., 2007
Tabanca N.; Demirci B.; Crockett S.L.; Baser K.H.C.; Wedge D.E., Chemical composition and antifungal activity of Arnica longifolia, Aster hesperius, and Chrysothamnus nauseosus essential oils, J. Agric. Food Chem., 2007, 55, 21, 8430-8435, https://doi.org/10.1021/jf071379c . [all data]

Baser K.H.C., Ozek G., et al., 2006
Baser K.H.C.; Ozek G.; Ozek T.; Duran A., Composition of the essential oil of Centaurea huber-morathii Wagenitz isolated from seeds by microdistillation, Flavour Fragr. J., 2006, 21, 3, 568-570, https://doi.org/10.1002/ffj.1620 . [all data]

Demirci B., Baser K.H.C., et al., 2006
Demirci B.; Baser K.H.C.; Tabanca N.; Wedge D.E., Characterization of volatile constituents of Haplopappus greenei and studies on the antifungal activity against phytopathogens, J. Agric. Food Chem., 2006, 54, 8, 3146-3150, https://doi.org/10.1021/jf053222v . [all data]

Kürkçüoglu, Hüsnü Can Baser, et al., 2006
Kürkçüoglu, M.; Hüsnü Can Baser, K.; Iscan, G.; Malyer, H.; Kaynak, G., Composition and anticandidal activity of the essential oil of Chaerophyllum byzantinum Boiss., Flavour Fragr. J., 2006, 21, 1, 115-117, https://doi.org/10.1002/ffj.1539 . [all data]

Suleimenov Y.M., Atazhanova G.A., et al., 2006
Suleimenov Y.M.; Atazhanova G.A.; Ozek T.; Demirci B.; Kulyyasov A.T.; Adekenov S.M.; Baser K.H.C., Essential oil composition of three species of Achillea from Kazakhstan, Chem. Nat. Compd. (Engl. Transl.), 2006, 37, 5, 447-450, https://doi.org/10.1023/A:1014471326724 . [all data]

Tabanca, Demirci, et al., 2006
Tabanca, N.; Demirci, B.; Can Baser, K.H.; Aytac, Z.; Ekici, M.; Khan, S.I.; Jacob, M.R.; Wedge, D.E., Chemical Composition and Antifungal Activity of Salvia macrochlamys and Salvia recognita Essential Oils, J. Agric. Food Chem., 2006, 54, 18, 6593-6597, https://doi.org/10.1021/jf0608773 . [all data]

Demirci, Paper, et al., 2004
Demirci, F.; Paper, D.H.; Franz, G.; Hüsnü Can Baser, K., Investigation of the origanum onites L. essential oil using the Chorioallantoic Membrane (CAM) assay, J. Agric. Food Chem., 2004, 52, 2, 251-254, https://doi.org/10.1021/jf034850k . [all data]

Baser, Demirci, et al., 2003
Baser, K.H.C.; Demirci, B.; Dekebo, A.; Dagne, E., Essential oils of some Boswellia spp., myrrh and opopanax, Flavour Fragr. J., 2003, 18, 2, 153-156, https://doi.org/10.1002/ffj.1166 . [all data]

Demirci, Baser, et al., 2003
Demirci, B.; Baser, K.H.C.; Yildiz, B.; Bahcecioglu, Z., Composition of the essential oils of six endemic Salvia spp. from Turkey, Flavour Fragr. J., 2003, 18, 2, 116-121, https://doi.org/10.1002/ffj.1173 . [all data]

Viljoen, van Vuuren, et al., 2003
Viljoen, A.; van Vuuren, S.; Ernst, E.; Klepser, M.; Demirci, B.; Baser, H.; van Wyk, B.-E., Osmitopsis asteriscoides (Asteraceae)-the antimicrobial activity and essential oil composition of a Cape-Dutch remedy, J. Ethnopharmacol., 2003, 88, 2-3, 137-143, https://doi.org/10.1016/S0378-8741(03)00191-0 . [all data]

Baser, Demirci, et al., 2002
Baser, K.H.C.; Demirci, B.; Kirimer, N.; Satil, F.; Tumen, G., The essential oils of Thymus migricus and T. fedtschenkoi var. handelii from Turkey, Flavour Fragr. J., 2002, 17, 1, 41-45, https://doi.org/10.1002/ffj.1036 . [all data]

Baser, Nuriddinov, et al., 2002
Baser, K.H.C.; Nuriddinov, H.R.; Ozek, T.; Demirci, A.B.; Azcan, N.; Nigmatullaev, A.M., Essential oil of Arischrada korolkowii from the Chatkal mountains of Uzbekistan, Chem. Nat. Compd. (Engl. Transl.), 2002, 38, 1, 51-53, https://doi.org/10.1023/A:1015729731464 . [all data]

Tunalier, Kirimer, et al., 2002
Tunalier, Z.; Kirimer, N.; Baser, K.H.C., The composition of essential oils from various parts of Juniperus foetidissima, Chem. Nat. Compd. (Engl. Transl.), 2002, 38, 1, 43-47, https://doi.org/10.1023/A:1015725630556 . [all data]

Baser, Demirci, et al., 2001
Baser, K.H.C.; Demirci, B.; Tabanca, N.; Özek, T.; Gören, N., Composition of the essential oils of Tanacetum armenum (DC.) Schultz Bip., T. balsamita L., T. chiliophyllum (Fisch. Mey.) Schultz Bip. var. chiliophyllum and T. haradjani (Rech. fil.) Grierson and the enantiomeric distribution of camphor and carvone, Flavour Fragr. J., 2001, 16, 3, 195-200, https://doi.org/10.1002/ffj.977 . [all data]

Gören, Demirci, et al., 2001
Gören, N.; Demirci, B.; Baser, K.H.C., Composition of the essential oils of Tanacetum spp. from Turkey, Flavour Fragr. J., 2001, 16, 3, 191-194, https://doi.org/10.1002/ffj.976 . [all data]

Özcan, Akgül, et al., 2001
Özcan, M.; Akgül, A.; Bascr, K.H.C.; Özck, T.; Tabanca, N., Essential oil composition of sea fennel (Crithmum maritimum) form Turkey, Nahrung/Food, 2001, 45, 5, 353-356, https://doi.org/10.1002/1521-3803(20011001)45:5<353::AID-FOOD353>3.0.CO;2-4 . [all data]

Tabanca, Kirimer, et al., 2001
Tabanca, N.; Kirimer, N.; Demirci, B.; Demirci, F.; Can Baser, K.H., Composition and antimicrobial activity of the essential oils of Micromeria cristata subsp. phrygia and the enantiomeric distribution of borneol, J. Agric. Food Chem., 2001, 49, 9, 4300-4303, https://doi.org/10.1021/jf0105034 . [all data]

Baser, Özek, et al., 2000
Baser, K.H.C.; Özek, T.; Demirci, B.; Duman, H., Composition of the essential oil of Glaucosciadium cordifolium (Boiss.) Burtt et Davis from Turkey, Flavour Fragr. J., 2000, 15, 1, 45-46, https://doi.org/10.1002/(SICI)1099-1026(200001/02)15:1<45::AID-FFJ867>3.0.CO;2-L . [all data]

Baser, Kürkcüoglu, et al., 1998
Baser, K.H.C.; Kürkcüoglu, M.; Aytac, Z., Composition of the essential oil of Salvia euphratica Montbret ex Bentham var. euphratica from Turkey, Flavour Fragr. J., 1998, 13, 1, 63-64, https://doi.org/10.1002/(SICI)1099-1026(199801/02)13:1<63::AID-FFJ694>3.0.CO;2-Z . [all data]

Reddy, Angers, et al., 1998
Reddy, M.V.B.; Angers, P.; Gosselin, A.; Arul, J., Characterization and use of essential oil from Thymus vulgaris against Botrytis cinerea and Rhizopus stolonifer in strawberry fruits, Phytochemistry, 1998, 47, 8, 1515-1520, https://doi.org/10.1016/S0031-9422(97)00795-4 . [all data]