4-Chlorobenzoic acid hydrazide
- Formula: C7H7ClN2O
- Molecular weight: 170.596
- IUPAC Standard InChIKey: PKBGHORNUFQAAW-UHFFFAOYSA-N
- CAS Registry Number: 536-40-3
- Chemical structure:
View 3d structure (requires JavaScript / HTML 5) - Other names: 4-Chlorobenzhydrazide; p-Chlorobenzhydrazide; Benzoic acid, 4-chloro-, hydrazide; p-Chlorobenzohydrazide; p-Chlorobenzoic acid, hydrazide; p-Chlorobenzoic hydrazide; p-Chlorobenzoyl hydrazide; p-Chlorobenzoylhydrazine; Benzoic acid, p-chloro-, hydrazide; 4-Chlorobenzohydrazide; 4-Chlorobenzoyl hydrazide; 4-Chlorobenzoylhydrazine; NSC 54990

Phase change data

Data compiled by: William E. Acree, Jr., James S. Chickos
Enthalpy of fusion
ΔfusH (kJ/mol) | Temperature (K) | Method | Reference |
---|---|---|---|
32.9 | 437.2 | DSC | Chickos and Acree, 2002 |

References

Chickos and Acree, 2002
Chickos, James S.; Acree, William E.,
Total phase change entropies and enthalpies,
Thermochimica Acta, 2002, 395, 1-2, 59-113, https://doi.org/10.1016/S0040-6031(02)00213-7
. [all data]