(R)-2-methylpentanal
- Formula: C6H12O
- Molecular weight: 100.1589
- IUPAC Standard InChIKey: FTZILAQGHINQQR-LURJTMIESA-N
- CAS Registry Number: 53531-14-9
- Chemical structure:
View 3d structure (requires JavaScript / HTML 5) - Stereoisomers:

Phase change data

Data compiled by: Thermodynamics Research Center, NIST Boulder Laboratories, Chris Muzny director
Quantity | Value | Units | Method | Reference | Comment |
---|---|---|---|---|---|
Tboil | 392. | K | N/A | Djerassi and Geller, 1959 | Uncertainty assigned by TRC = 3. K |

References

Djerassi and Geller, 1959
Djerassi, C.; Geller, L.E.,
Optical rotary dispersion studies: xxiv effect of distance of a single asymmetric center from an aliphatic carbonyl function,
J. Am. Chem. Soc., 1959, 81, 2789. [all data]