2-acetoxypropanoic acid
- Formula: C5H8O4
- Molecular weight: 132.1146
- IUPAC Standard InChIKey: WTLNOANVTIKPEE-UHFFFAOYSA-N
- CAS Registry Number: 535-17-1
- Chemical structure:
View 3d structure (requires JavaScript / HTML 5) - Other names: α-Acetoxypropionic acid

Phase change data

Data compiled by: Robert L. Brown and Stephen E. Stein
Quantity | Value | Units | Method | Reference | Comment |
---|---|---|---|---|---|
Tfus | 330. to 333. | K | N/A | Buckingham and Donaghy, 1982 |
Reduced pressure boiling point
Tboil (K) | Pressure (bar) | Reference |
---|---|---|
400. | 0.015 | Buckingham and Donaghy, 1982 |

Normal alkane RI, non-polar column, custom temperature program

Column type | Active phase | I | Reference | Comment |
---|---|---|---|---|
Capillary | HP-1 | 1067. | Teai, Claude-Lafontaine, et al., 2001 | 50. m/0.32 mm/0.52 μm, N2; Program: 40C => 2C/min => 130C => 4C/min => 250C |

References

Buckingham and Donaghy, 1982
Buckingham, J.; Donaghy, S.M.,
Dictionary of Organic Compounds: Fifth Edition, Chapman and Hall, New York, 1982, 1. [all data]
Teai, Claude-Lafontaine, et al., 2001
Teai, T.; Claude-Lafontaine, A.; Schippa, C.; Cozzolino, F.,
Volatile compounds in fresh pulp of pineapple (Ananas comosus [L.] Merr.) from French Polynesia,
J. Essent. Oil Res., 2001, 13, 5, 314-318, https://doi.org/10.1080/10412905.2001.9712222
. [all data]