Propanenitrile, 3-(diethylamino)-
- Formula: C7H14N2
- Molecular weight: 126.1995
- IUPAC Standard InChIKey: LFFKXGFSDGRFQA-UHFFFAOYSA-N
- CAS Registry Number: 5351-04-2
- Chemical structure:
View 3d structure (requires JavaScript / HTML 5) - Other names: Propionitrile, 3-(diethylamino)-; N-(2-Cyanoethyl)diethylamine; 3-(Diethylamino)propionitrile; 3-(Diethylamino)propanenitrile; 3-diethylaminopropiononitrile

Phase change data

Data compiled as indicated in comments:
TRC - Thermodynamics Research Center, NIST Boulder Laboratories, Chris Muzny director
AC - William E. Acree, Jr., James S. Chickos
Quantity | Value | Units | Method | Reference | Comment |
---|---|---|---|---|---|
Tfus | 213.25 | K | N/A | Witschonke, 1954 | Uncertainty assigned by TRC = 0.3 K; TRC |
Tfus | 213.65 | K | N/A | Witschonke, 1954 | Uncertainty assigned by TRC = 0.2 K; TRC |
Enthalpy of vaporization
ΔvapH (kJ/mol) | Temperature (K) | Method | Reference | Comment |
---|---|---|---|---|
53.7 | 353. | A | Stephenson and Malanowski, 1987 | Based on data from 338. to 470. K.; AC |

References

Witschonke, 1954
Witschonke, C.R.,
Freezing point and purity data for some organic compounds,
Anal. Chem., 1954, 26, 562-4. [all data]
Stephenson and Malanowski, 1987
Stephenson, Richard M.; Malanowski, Stanislaw,
Handbook of the Thermodynamics of Organic Compounds, 1987, https://doi.org/10.1007/978-94-009-3173-2
. [all data]