Methanone, diphenyl-, hydrazone
- Formula: C13H12N2
- Molecular weight: 196.2478
- IUPAC Standard InChIKey: QYCSNMDOZNUZIT-UHFFFAOYSA-N
- CAS Registry Number: 5350-57-2
- Chemical structure:
View 3d structure (requires JavaScript / HTML 5) - Other names: Benzophenone, hydrazone; Benzophenoneimine N-amino-

Phase change data

Data compiled by: Robert L. Brown and Stephen E. Stein
Reduced pressure boiling point
Tboil (K) | Pressure (bar) | Reference |
---|---|---|
500.7 | 0.073 | Weast and Grasselli, 1989 |

References

Weast and Grasselli, 1989
CRC Handbook of Data on Organic Compounds, 2nd Editon, Weast,R.C and Grasselli, J.G., ed(s)., CRC Press, Inc., Boca Raton, FL, 1989, 1. [all data]
(editor), 1984
(editor), Koptyug V.A.,
Atlas of Spectra of Aromatic and Heterocyclic Compounds, 1984, 29, 9. [all data]