Benzyltrimethylammonium bromide
- Formula: C10H16N·Br
- Molecular weight: 230.145
- IUPAC Standard InChIKey: UUZYBYIOAZTMGC-UHFFFAOYSA-M
- CAS Registry Number: 5350-41-4
- Chemical structure:
View 3d structure (requires JavaScript / HTML 5) - Other names: N-Benzyl-N,N,N-trimethylammonium bromide; Benzenemethanaminium, N,N,N-trimethyl-, bromide; (Benzyltrimethyl)ammonium bromide(btm); (Trimethylbenzyl)ammonium bromide; Ammonium, (benzyltrimethyl)-, bromide; WV 562

Reaction thermochemistry data

Data compiled by: Hussein Y. Afeefy, Joel F. Liebman, and Stephen E. Stein
Individual Reactions
=
+ C10H15N
By formula: C10H16N.Br = HBr + C10H15N
Quantity | Value | Units | Method | Reference | Comment |
---|---|---|---|---|---|
ΔrH° | -88. ± 4. | kJ/mol | Cm | Arnett and Wernett, 1993 | liquid phase; solvent: DMSO |

References

Arnett and Wernett, 1993
Arnett, E.M.; Wernett, P.C.,
Energetics of P, S, and N ylide formation and reaction in solution,
J. Org. Chem., 1993, 58, 301-303. [all data]