Undecanone
- Formula: C11H22O
- Molecular weight: 170.2918
- IUPAC Standard InChIKey: KYWIYKKSMDLRDC-UHFFFAOYSA-N
- CAS Registry Number: 53452-70-3
- Chemical structure:
View 3d structure (requires JavaScript / HTML 5) - Species with the same structure:

Kovats' RI, non-polar column, temperature ramp

Column type | Active phase | I | Reference | Comment |
---|---|---|---|---|
Capillary | BP-1 | 1273. | Raina, Srivastava, et al., 2002 | 25. m/0.55 mm/0.25 μm, N2, 5. K/min, 220. C @ 15. min; Tstart: 60. C |

Van Den Dool and Kratz RI, non-polar column, custom temperature program

Column type | Active phase | I | Reference | Comment |
---|---|---|---|---|
Capillary | SE-52 | 1294. | Sacchetti, Guerrini, et al., 2006 | 30. m/0.32 mm/0.15 μm, He; Program: 45C => 1C/min => 100C => 5C/min => 250C(10min) |

Normal alkane RI, non-polar column, temperature ramp

Column type | Active phase | I | Reference | Comment |
---|---|---|---|---|
Capillary | RTX-5 | 1295. | Kovacevic and Kac, 2002 | 30. m/0.25 mm/0.25 μm, He, 60. C @ 3. min, 1. K/min; Tend: 150. C |

Normal alkane RI, non-polar column, custom temperature program

Column type | Active phase | I | Reference | Comment |
---|---|---|---|---|
Capillary | SPB-5 | 1291. | Navickiene, Morandim, et al., 2006 | 30. m/0.25 mm/0.10 μm, Helium; Program: 40 0C (1 min) 10 0C/min -> 120 0C 0.5 0C/min -> 150 0C 20 0C/min -> 280 0C (5 min) |
Capillary | HP-1 | 1274. | Kovacevic and Kac, 2002 | 25. m/0.2 mm/0.11 μm; Program: 60C (3min) => 2.5C/min => 190C (1min) => 70C/min => 240V (11min) |

References

Raina, Srivastava, et al., 2002
Raina, V.K.; Srivastava, S.K.; Jain, N.; Ahmad, A.; Syamasundar, K.V.; Aggarwal, K.K.,
Essential oil composition of Curcuma longa L. cv. Roma from the plains of northern India,
Flavour Fragr. J., 2002, 17, 2, 99-102, https://doi.org/10.1002/ffj.1053
. [all data]
Sacchetti, Guerrini, et al., 2006
Sacchetti, G.; Guerrini, A.; Noriega, P.; Bianchi, A.; Bruni, R.,
Essential oil of wild Ocotea quixos (Lam.) Kosterm. (Lauraceae) leaves from Amazonian Ecuador,
Flavour Fragr. J., 2006, 21, 4, 674-676, https://doi.org/10.1002/ffj.1648
. [all data]
Kovacevic and Kac, 2002
Kovacevic, N.; Kac, M.,
Analytical, nutritional, and clinical methods section. Determination and verification of hop varieties by analysis of essential oils,
Food Chem., 2002, 77, 4, 489-494, https://doi.org/10.1016/S0308-8146(02)00114-0
. [all data]
Navickiene, Morandim, et al., 2006
Navickiene, H.M.D.; Morandim, A.A.; Alécio, A.C.; Regasini, L.O.; Bergamo, D.C.B.; Telascrea, M.; Cavalheiro, A.J.; Lopes, M.N.; Bolzani, V.S.; Furlan, M.; Marques, M.O.M.; Young, M.C.M.; Kato, M.J.,
Composition and antifungal activity of essential oils from Piper aduncum, Piper arboreum and Piper tuberculatum,
Quim. Nova, 2006, 29, 3, 467-470, https://doi.org/10.1590/S0100-40422006000300012
. [all data]