2-Aminobenzyl alcohol
- Formula: C7H9NO
- Molecular weight: 123.1525
- IUPAC Standard InChIKey: VYFOAVADNIHPTR-UHFFFAOYSA-N
- CAS Registry Number: 5344-90-1
- Chemical structure:
View 3d structure (requires JavaScript / HTML 5) - Other names: Benzyl alcohol, o-amino-; o-(Hydroxymethyl)aniline; o-Aminobenzyl alcohol; o-Aminobenzylic alcohol; o-Aminophenylcarbinol; Benzenemethanol, 2-amino-; 2-Aminobenzenemethanol; (2-Aminophenyl)methanol; NSC 1173; (o-Aminophenyl)methanol

Phase change data

Data compiled by: Robert L. Brown and Stephen E. Stein
Quantity | Value | Units | Method | Reference | Comment |
---|---|---|---|---|---|
Tboil | 548.2 | K | N/A | Weast and Grasselli, 1989 | |
Tboil | 543. to 553. | K | N/A | Buckingham and Donaghy, 1982 | |
Quantity | Value | Units | Method | Reference | Comment |
Tfus | 357. | K | N/A | Buckingham and Donaghy, 1982 |
Reduced pressure boiling point
Tboil (K) | Pressure (bar) | Reference |
---|---|---|
435.2 | 0.020 | Aldrich Chemical Company Inc., 1990 |
433. | 0.007 to 0.013 | Buckingham and Donaghy, 1982 |

References

Weast and Grasselli, 1989
CRC Handbook of Data on Organic Compounds, 2nd Editon, Weast,R.C and Grasselli, J.G., ed(s)., CRC Press, Inc., Boca Raton, FL, 1989, 1. [all data]
Buckingham and Donaghy, 1982
Buckingham, J.; Donaghy, S.M.,
Dictionary of Organic Compounds: Fifth Edition, Chapman and Hall, New York, 1982, 1. [all data]
Aldrich Chemical Company Inc., 1990
Aldrich Chemical Company Inc.,
Catalog Handbook of Fine Chemicals, Aldrich Chemical Company, Inc., Milwaukee WI, 1990, 1. [all data]
Lang (editor), 1961
Lang (editor), L.,
Absorption Spectra in the Ultraviolet and Visible Region, 1961, 2, 183. [all data]