β-Cyanopropiophenone
- Formula: C10H9NO
- Molecular weight: 159.1846
- IUPAC Standard InChIKey: OSPRTYTUQJCKFF-UHFFFAOYSA-N
- CAS Registry Number: 5343-98-6
- Chemical structure:
View 3d structure (requires JavaScript / HTML 5) - Permanent link for this species. Use this link for bookmarking this species for future reference.

Gas phase thermochemistry data

Data compiled by: Hussein Y. Afeefy, Joel F. Liebman, and Stephen E. Stein
Quantity | Value | Units | Method | Reference | Comment |
---|---|---|---|---|---|
ΔfH°gas | 30. ± 0.46 | kJ/mol | Ccb | Lebedeva, Dneprovskii, et al., 1969 | See Lebedeva, Rjadnenko, et al., 1969 |

Condensed phase thermochemistry data

Data compiled by: Hussein Y. Afeefy, Joel F. Liebman, and Stephen E. Stein
Quantity | Value | Units | Method | Reference | Comment |
---|---|---|---|---|---|
ΔfH°solid | -71.46 ± 0.46 | kJ/mol | Ccb | Lebedeva, Dneprovskii, et al., 1969 | See Lebedeva, Rjadnenko, et al., 1969 |
Quantity | Value | Units | Method | Reference | Comment |
ΔcH°solid | -5149.96 ± 0.46 | kJ/mol | Ccb | Lebedeva, Dneprovskii, et al., 1969 | See Lebedeva, Rjadnenko, et al., 1969 |

Phase change data

Data compiled as indicated in comments:
ALS - Hussein Y. Afeefy, Joel F. Liebman, and Stephen E. Stein
AC - William E. Acree, Jr., James S. Chickos
Quantity | Value | Units | Method | Reference | Comment |
---|---|---|---|---|---|
ΔsubH° | 102. ± 4.2 | kJ/mol | V | Lebedeva, Dneprovskii, et al., 1969 | See Lebedeva, Rjadnenko, et al., 1969; ALS |
Enthalpy of sublimation
ΔsubH (kJ/mol) | Temperature (K) | Method | Reference | Comment |
---|---|---|---|---|
108.5 | 325.5 | A | Stephenson and Malanowski, 1987 | Based on data from 318. to 333. K.; AC |

References

Lebedeva, Dneprovskii, et al., 1969
Lebedeva, N.D.; Dneprovskii, A.S.; Katin, Yu.A.,
Heats of combustion and enthalpies of formation of benzoyl cyanide, ω-cyanoacetophenone, and β-cyanopropiophenone,
Russ. J. Phys. Chem. (Engl. Transl.), 1969, 43, 770-773. [all data]
Lebedeva, Rjadnenko, et al., 1969
Lebedeva, N.D.; Rjadnenko, B.L.; Gutner, N.M.,
Heats of formation of some N-containing organic compounds,
Int. Conf. Calorim. Therm. (Warsaw, Poland), 1969, 1-8. [all data]
Stephenson and Malanowski, 1987
Stephenson, Richard M.; Malanowski, Stanislaw,
Handbook of the Thermodynamics of Organic Compounds, 1987, https://doi.org/10.1007/978-94-009-3173-2
. [all data]