2,2,3-trimethylhexan-3-ol
- Formula: C9H20O
- Molecular weight: 144.2545
- IUPAC Standard InChIKey: DHNHHYWBZNQHGN-UHFFFAOYSA-N
- CAS Registry Number: 5340-41-0
- Chemical structure:
View 3d structure (requires JavaScript / HTML 5) - Other names: 2,2,3-Trimethyl-3-hexanol

Phase change data

Data compiled as indicated in comments:
TRC - Thermodynamics Research Center, NIST Boulder Laboratories, Chris Muzny director
AC - William E. Acree, Jr., James S. Chickos
Quantity | Value | Units | Method | Reference | Comment |
---|---|---|---|---|---|
Tboil | 443.15 | K | N/A | Leroide, 1921 | Uncertainty assigned by TRC = 4. K; TRC |
Enthalpy of vaporization
ΔvapH (kJ/mol) | Temperature (K) | Reference | Comment |
---|---|---|---|
55.1 | 358. | Wilhoit and Zwolinski, 1973 | Based on data from 343. to 441. K.; AC |

References

Leroide, 1921
Leroide, J.,
Ann. Chim. (Paris), 1921, 16, 354. [all data]
Wilhoit and Zwolinski, 1973
Wilhoit, R.C.; Zwolinski, B.J.,
Physical and thermodynamic properties of aliphatic alcohols,
J. Phys. Chem. Ref. Data Suppl., 1973, 1, 2, 1. [all data]