3-Octanol, 3-methyl-
- Formula: C9H20O
- Molecular weight: 144.2545
- IUPAC Standard InChIKey: JEWXYDDSLPIBBO-UHFFFAOYSA-N
- CAS Registry Number: 5340-36-3
- Chemical structure:
View 3d structure (requires JavaScript / HTML 5) - Other names: Amylethylmethylcarbinol; 3-Methyl-3-octanol; 2-Ethyl-2-heptanol; Aprol 161; 3-Methyloctan-3-ol

Phase change data

Data compiled by: William E. Acree, Jr., James S. Chickos
Enthalpy of vaporization
ΔvapH (kJ/mol) | Temperature (K) | Reference | Comment |
---|---|---|---|
53.2 | 368. | Wilhoit and Zwolinski, 1973 | Based on data from 353. to 388. K. |

References

Wilhoit and Zwolinski, 1973
Wilhoit, R.C.; Zwolinski, B.J.,
Physical and thermodynamic properties of aliphatic alcohols,
J. Phys. Chem. Ref. Data Suppl., 1973, 1, 2, 1. [all data]