(1R)-(-)-Thiocamphor

Phase change data

Data compiled by: William E. Acree, Jr., James S. Chickos

Quantity Value Units Method Reference Comment
Δvap55.5kJ/molGCvan Roon, Parsons, et al., 2002
Quantity Value Units Method Reference Comment
Δsub61.7 ± 0.9kJ/molN/ARoux, Jiménez, et al., 1999

Enthalpy of sublimation

ΔsubH (kJ/mol) Temperature (K) Method Reference Comment
62.2 ± 0.9272.MERoux, Jiménez, et al., 1999Based on data from 262. - 282. K.

References

van Roon, Parsons, et al., 2002
van Roon, André; Parsons, John R.; Govers, Harrie A.J., Gas chromatographic determination of vapour pressure and related thermodynamic properties of monoterpenes and biogenically related compounds, Journal of Chromatography A, 2002, 955, 1, 105-115, https://doi.org/10.1016/S0021-9673(02)00200-5 . [all data]

Roux, Jiménez, et al., 1999
Roux, M.V.; Jiménez, P.; Dávalos, J.Z.; Notario, R.; Abboud, J.-L.M., Thermochemistry of neutral and protonated 1,7,7-trimethylbicyclo[2.2.1]heptan-2-thione (thiocamphor), The Journal of Chemical Thermodynamics, 1999, 31, 11, 1457-1467, https://doi.org/10.1006/jcht.1999.0510 . [all data]