Benzeneethanol, 2-amino-
- Formula: C8H11NO
- Molecular weight: 137.1790
- IUPAC Standard InChIKey: ILDXSRFKXABMHH-UHFFFAOYSA-N
- CAS Registry Number: 5339-85-5
- Chemical structure:
View 3d structure (requires JavaScript / HTML 5) - Other names: 2-Aminophenethyl alcohol; Phenethyl alcohol, o-amino-; 2-(o-Aminophenyl)ethanol; o-aminophenethyl alcohol

Phase change data

Data compiled by: Robert L. Brown and Stephen E. Stein
Reduced pressure boiling point
Tboil (K) | Pressure (bar) | Reference |
---|---|---|
420.7 | 0.005 | Weast and Grasselli, 1989 |
428. | 0.007 | Buckingham and Donaghy, 1982 |
420. to 421. | 0.0047 | Buckingham and Donaghy, 1982 |

References

Weast and Grasselli, 1989
CRC Handbook of Data on Organic Compounds, 2nd Editon, Weast,R.C and Grasselli, J.G., ed(s)., CRC Press, Inc., Boca Raton, FL, 1989, 1. [all data]
Buckingham and Donaghy, 1982
Buckingham, J.; Donaghy, S.M.,
Dictionary of Organic Compounds: Fifth Edition, Chapman and Hall, New York, 1982, 1. [all data]