N-Formyl-dl-leucine
- Formula: C7H13NO3
- Molecular weight: 159.1830
- IUPAC Standard InChIKey: HFBHOAHFRNLZGN-UHFFFAOYSA-N
- CAS Registry Number: 5338-45-4
- Chemical structure:
View 3d structure (requires JavaScript / HTML 5) - Other names: DL-Leucine, N-formyl-

Condensed phase thermochemistry data

Data compiled by: Hussein Y. Afeefy, Joel F. Liebman, and Stephen E. Stein
Quantity | Value | Units | Method | Reference | Comment |
---|---|---|---|---|---|
ΔcH°solid | -3841.6 ± 0.3 | kJ/mol | Ccb | Wrede, 1911 |

References

Wrede, 1911
Wrede, F.,
Uber die Bestimmung von Berbrennungswarmen mittels der kalorimetrischen Bombe unter Benutzung des Platinwiderstandsthermometers,
Z. Phys. Chem. (Leipzig), 1911, 81-94. [all data]