Cyclohexanol, 2,6-dimethyl-

Condensed phase thermochemistry data

Data compiled by: Hussein Y. Afeefy, Joel F. Liebman, and Stephen E. Stein

Quantity Value Units Method Reference Comment
Δcliquid-5044.2kJ/molCcbZubova, 1901Corresponding Δfliquid = -390. kJ/mol (simple calculation by NIST; no Washburn corrections)

Phase change data

Data compiled by: Robert L. Brown and Stephen E. Stein

Quantity Value Units Method Reference Comment
Tboil447.7KN/AWeast and Grasselli, 1989

Van Den Dool and Kratz RI, non-polar column, temperature ramp

Data compiled by: NIST Mass Spectrometry Data Center, William E. Wallace, director

Column type CapillaryCapillaryCapillary
Active phase HP-5SE-54DB-5
Column length (m) 30.25.30.
Carrier gas HeH2He
Substrate
Column diameter (mm) 0.250.310.25
Phase thickness (μm) 0.25
Tstart (C) 50.35.50.
Tend (C) 220.250.250.
Heat rate (K/min) 3.4.4.
Initial hold (min)  3.
Final hold (min) 20.
I 1110.1111.1112.
ReferenceXian Q., Chen H., et al., 2006Li, Wang, et al., 1998Gómez, Ledbetter, et al., 1993
Comment MSDC-RI MSDC-RI MSDC-RI

References

Zubova, 1901
Zubova, P., Data about heat of combustion of compound cycle structure, Zh. Fiz. Khim., 1901, 33, 708-722. [all data]