1-Nitro-2,5-pyrrolidine-dione
- Formula: C4H4N2O4
- Molecular weight: 144.0856
- IUPAC Standard InChIKey: LVBLRJFVMMAALZ-UHFFFAOYSA-N
- CAS Registry Number: 5336-95-8
- Chemical structure:
View 3d structure (requires JavaScript / HTML 5) - Permanent link for this species. Use this link for bookmarking this species for future reference.

Condensed phase thermochemistry data

Data compiled by: Hussein Y. Afeefy, Joel F. Liebman, and Stephen E. Stein
Quantity | Value | Units | Method | Reference | Comment |
---|---|---|---|---|---|
ΔcH°solid | -1787. | kJ/mol | Ccb | Handrick, 1956 | |
ΔcH°solid | -1820.0 ± 2.1 | kJ/mol | Ccb | Young, Keith, et al., 1956 | Reanalyzed by Cox and Pilcher, 1970, Original value = -1828. kJ/mol |

References

Handrick, 1956
Handrick, G.R.,
Report of the study of pure explosive compounds. Part IV. Calculation of heat of combustion of organic compounds from structural features and calculation of power of high explosives, Rpt. C-58247 for the Office of the Chief of Ordnance, contract DA-19-020-ORD-47 by the Arthur D. Little, Inc., Cambridge, MA, 1956, 467-573. [all data]
Young, Keith, et al., 1956
Young, J.A.; Keith, J.E.; Stehle, P.; Dzombak, W.C.; Hunt, H.,
Heats of combustion of some organic nitrogen compounds,
Ind. Eng. Chem., 1956, 48, 1375-1378. [all data]
Cox and Pilcher, 1970
Cox, J.D.; Pilcher, G.,
Thermochemistry of Organic and Organometallic Compounds, Academic Press, New York, 1970, 1-636. [all data]