Cyclopentane, (2-methylbutyl)-
- Formula: C10H20
- Molecular weight: 140.2658
- IUPAC Standard InChIKey: UORQAXQHLSZGRH-UHFFFAOYSA-N
- CAS Registry Number: 53366-38-4
- Chemical structure:
View 3d structure (requires JavaScript / HTML 5) - Other names: (2-Methylbutyl)cyclopentane

Kovats' RI, non-polar column, isothermal

Column type | Active phase | Temperature (C) | I | Reference | Comment |
---|---|---|---|---|---|
Packed | Squalane | 100. | 1000. | Bogoslovsky, Anvaer, et al., 1978 | |
Packed | Squalane | 120. | 1004. | Bogoslovsky, Anvaer, et al., 1978 | |
Packed | Squalane | 80. | 995. | Bogoslovsky, Anvaer, et al., 1978 | |
Capillary | Squalane | 100. | 1000. | Dielmann, Schwengers, et al., 1974 | Column length: 100. m; Column diameter: 0.25 mm |
Capillary | Squalane | 120. | 1004. | Dielmann, Schwengers, et al., 1974 | Column length: 100. m; Column diameter: 0.25 mm |
Capillary | Squalane | 80. | 996. | Dielmann, Schwengers, et al., 1974 | Column length: 100. m; Column diameter: 0.25 mm |

Normal alkane RI, non-polar column, custom temperature program

Column type | Active phase | I | Reference | Comment |
---|---|---|---|---|
Capillary | Squalane | 998. | Chen, 2008 | Program: not specified |

References

Bogoslovsky, Anvaer, et al., 1978
Bogoslovsky, Yu.N.; Anvaer, B.I.; Vigdergauz, M.S.,
Chromatographic constants in gas chromatography (in Russian), Standards Publ. House, Moscow, 1978, 192. [all data]
Dielmann, Schwengers, et al., 1974
Dielmann, G.; Schwengers, D.; Schomburg, G.,
Gas-chromatographische Retentionsdaten und Strukture chemischer Verbindungen Gesättigte und ungesättigte alkylsubstituierte Cyclopentane und Methylcyclopentane,
Chromatographia, 1974, 7, 5, 215-224, https://doi.org/10.1007/BF02321771
. [all data]
Chen, 2008
Chen, H.-F.,
Quantitative prediction of gas chromatography retention indices with support vector machines, radial basis neutral networks and multiple linear regression,
Anal. Chim. Acta, 2008, 609, 1, 24-36, https://doi.org/10.1016/j.aca.2008.01.003
. [all data]