CAS Reg. No. 53293-42-8
- CAS Registry Number: 53293-42-8

Reaction thermochemistry data

Data compiled by: John E. Bartmess
Individual Reactions
(CAS Reg. No. 53293-42-8 • 4294967295) +
= CAS Reg. No. 53293-42-8
By formula: (CAS Reg. No. 53293-42-8 • 4294967295CrO) + CrO = CAS Reg. No. 53293-42-8
Quantity | Value | Units | Method | Reference | Comment |
---|---|---|---|---|---|
ΔrH° | 617. ± 36. | kJ/mol | N/A | Wenthold, Jonas, et al., 1997 | gas phase |

References

Wenthold, Jonas, et al., 1997
Wenthold, P.G.; Jonas, K.-L.; Lineberger, W.C.,
Ultraviolet Photoelectron Spectroscopy of the Chromium Dioxide Negative Ion,
J. Chem. Phys., 1997, 106, 23, 9961, https://doi.org/10.1063/1.473840
. [all data]