5-Hexynoic acid
- Formula: C6H8O2
- Molecular weight: 112.1265
- IUPAC Standard InChIKey: VPFMEXRVUOPYRG-UHFFFAOYSA-N
- CAS Registry Number: 53293-00-8
- Chemical structure:
View 3d structure (requires JavaScript / HTML 5) - Permanent link for this species. Use this link for bookmarking this species for future reference.

Phase change data

Data compiled by: Robert L. Brown and Stephen E. Stein
Reduced pressure boiling point
Tboil (K) | Pressure (bar) | Reference |
---|---|---|
346. to 349. | 0.0003 | Farchan Laboratories, 1990 |

References

Farchan Laboratories, 1990
Farchan Laboratories,
Research Chemicals Catalog, Farchan Laboratories, Gainesville, FL, 1990, 91. [all data]