Ethyl trans β-(2-furyl)acrylate

Phase change data

Data compiled by: William E. Acree, Jr., James S. Chickos

Enthalpy of vaporization

ΔvapH (kJ/mol) Temperature (K) Reference Comment
56.8464.Fromm and Loeffler, 1956Based on data from 428. - 500. K.

References

Fromm and Loeffler, 1956
Fromm, F.; Loeffler, Sister M. Constance, The Vapor Pressure of Ethyl trans-β-(2-FURYL) Acrylate, J. Phys. Chem., 1956, 60, 2, 252-253, https://doi.org/10.1021/j150536a028 . [all data]