N-Benzylstearamide
- Formula: C25H43NO
- Molecular weight: 373.6150
- IUPAC Standard InChIKey: IXODJGLAVBPVSW-UHFFFAOYSA-N
- CAS Registry Number: 5327-45-7
- Chemical structure:
View 3d structure (requires JavaScript / HTML 5) - Other names: Octadecanamide, N-(phenylmethyl)-; Octadecanamide, N-benzyl-; Stearamide, N-benzyl-; N-(Phenylmethyl)octadecanamide; N-Benzyloctadecanamide; NSC 3333; RMA042LEX, RT: 28.252 min, Maca, Lepidium meyenii, Mega Market Rockville

Van Den Dool and Kratz RI, non-polar column, custom temperature program

Column type | Active phase | I | Reference | Comment |
---|---|---|---|---|
Capillary | HP-5MS | 3087.1 | Andriamaharavo, 2014 | 30. m/0.25 mm/0.25 μm, He; Program: 60C (1 min) => 5 C/min => 210C => 10 C/min => 280C (15 min) |
Capillary | HP-5MS | 3100.6 | Andriamaharavo, 2014 | 30. m/0.25 mm/0.25 μm, He; Program: 60C (1 min) => 5 C/min => 210C => 10 C/min => 280C (15 min) |

Phase change data

Data compiled by: Thermodynamics Research Center, NIST Boulder Laboratories, Chris Muzny director
Quantity | Value | Units | Method | Reference | Comment |
---|---|---|---|---|---|
Tfus | 372.35 | K | N/A | Mod, Magne, et al., 1962 | Uncertainty assigned by TRC = 0.5 K |

References

Andriamaharavo, 2014
Andriamaharavo, N.R.,
Retention Data. NIST Mass Spectrometry Data Center., NIST Mass Spectrometry Data Center, 2014. [all data]