Benzene, 1,3,5-trichloro-2,4,6-trimethyl-
- Formula: C9H9Cl3
- Molecular weight: 223.527
- IUPAC Standard InChIKey: VMNISWKTOHUZQN-UHFFFAOYSA-N
- CAS Registry Number: 5324-68-5
- Chemical structure:
View 3d structure (requires JavaScript / HTML 5) - Other names: Mesitylene, 2,4,6-trichloro-; 2,4,6-Trichloromesitylene; 1,3,5-Trichloro-2,4,6-trimethylbenzene

Condensed phase thermochemistry data

Data compiled by: Eugene S. Domalski and Elizabeth D. Hearing
Constant pressure heat capacity of solid
Cp,solid (J/mol*K) | Temperature (K) | Reference | Comment |
---|---|---|---|
232.39 | 300. | Fujiwara, Atake, et al., 1990 | T = 3 to 327 K. Unsmoothed experimental datum. |

Phase change data

Data compiled by: Eugene S. Domalski and Elizabeth D. Hearing
Temperature of phase transition
Ttrs (K) | Initial Phase | Final Phase | Reference | Comment |
---|---|---|---|---|
314. | crystaline, III | crystaline, II | Fujiwara, Atake, et al., 1990 | Superheating effect. |
Enthalpy of phase transition
ΔHtrs (kJ/mol) | Temperature (K) | Initial Phase | Final Phase | Reference | Comment |
---|---|---|---|---|---|
0.142 | 158.7 | crystaline, IV | crystaline, III | Fujiwara, Atake, et al., 1990 | Anomaly splits into two peaks depending on sample history. 163.5 K, H = 87 J/mol |

References

Fujiwara, Atake, et al., 1990
Fujiwara, T.; Atake, T.; Chihara, H.,
Heat capacities and phase transitions of crystalline 1,3,5-trichloro-2,4,6-trimethylbenzene,
Bull. Chem. Soc. Jpn., 1990, 63(3), 657-665. [all data]
(editor), 1973
(editor), Koptyug V.A.,
Atlas of Spectra of Aromatic and Heterocyclic Compounds, 1973, 3, 17. [all data]