Mitotane
- Formula: C14H10Cl4
- Molecular weight: 320.041
- IUPAC Standard InChIKey: JWBOIMRXGHLCPP-UHFFFAOYSA-N
- CAS Registry Number: 53-19-0
- Chemical structure:
View 3d structure (requires JavaScript / HTML 5) - Other names: Benzene, 1-chloro-2-[2,2-dichloro-1-(4-chlorophenyl)ethyl]-; Ethane, 1,1-dichloro-2-(o-chlorophenyl)-2-(p-chlorophenyl)-; o,p'-Dichlorodiphenyldichloroethane; o,p'-DDD; o,p'-TDE; Chloditan; Chlodithane; CB 313; Lysodren; Mitotan; NSC-38721; 2,2-Bis(2-Chlorophenyl-4-chlorophenyl)-1,1-dichloroethane; 2,4'-Dichlorodiphenyldichloroethane; 1-(o-Chlorophenyl)-1-(p-chlorophenyl)-2,2-dichloroethane; 1-(2-Chlorophenyl)-1-(4-chlorophenyl)-2,2-dichloroethane; Chlodithan; Ethane, 2-(o-chlorophenyl)-2-(p-chlorophenyl)-1,1-dichloro-; Khlodithan; NCI-C04933; 1,1-Dichloro-2-(o-chlorophenyl)-2-(p-chlorophenyl)ethane; 1,1-Dichloro-2,2-bis(2,4'-dichlorophenyl)ethane; 2-(o-Chlorophenyl)-2-(p-chlorophenyl)-1,1-dichloroethane; 2,4'-DDD; 1,1-Dichloro-2-(p-chlorophenyl)-2-(o-chlorophenyl)ethane; 2,4'-Dichlorophenyldichlorethane; Opeprim; DDD-o,p'; 2-(2-Chlorophenyl)-2-(4-chlorophenyl)-1,1-dichloroethane; o,p-DDD; o,p'-DDE

Phase change data

Data compiled by: Thermodynamics Research Center, NIST Boulder Laboratories, Chris Muzny director
Quantity | Value | Units | Method | Reference | Comment |
---|---|---|---|---|---|
Tfus | 349.4 | K | N/A | Plato and Glasgow, 1969 | Uncertainty assigned by TRC = 0.2 K |

Kovats' RI, non-polar column, custom temperature program

Column type | Active phase | I | Reference | Comment |
---|---|---|---|---|
Packed | SE-30 | 2130. | Ramsey, Lee, et al., 1980 | He, Chromosorb G HP (80-100 mesh); Column length: 1.5 m; Program: not specified |

Van Den Dool and Kratz RI, non-polar column, temperature ramp

Column type | Active phase | I | Reference | Comment |
---|---|---|---|---|
Capillary | OV-1 | 2119. | de Paoli, Taccheo-Barbina, et al., 1991 | 25. m/0.32 mm/0.10 μm, 160. C @ 1. min, 1. K/min; Tend: 240. C |
Capillary | OV-1 | 2123. | de Paoli, Taccheo-Barbina, et al., 1991 | 25. m/0.32 mm/0.10 μm, 160. C @ 1. min, 1. K/min; Tend: 240. C |
Capillary | OV-1 | 2116. | de Paoli, Taccheo-Barbina, et al., 1991 | 25. m/0.32 mm/0.10 μm, 160. C @ 1. min, 1.3 K/min; Tend: 240. C |
Capillary | OV-1 | 2128. | de Paoli, Taccheo-Barbina, et al., 1991 | 25. m/0.32 mm/0.10 μm, 160. C @ 1. min, 1.3 K/min; Tend: 240. C |
Capillary | OV-1 | 2119. | de Paoli, Taccheo-Barbina, et al., 1991 | 25. m/0.32 mm/0.10 μm, 160. C @ 1. min, 1.5 K/min; Tend: 240. C |
Capillary | OV-1 | 2123. | de Paoli, Taccheo-Barbina, et al., 1991 | 25. m/0.32 mm/0.10 μm, 160. C @ 1. min, 1.5 K/min; Tend: 240. C |
Capillary | OV-1 | 2116. | de Paoli, Taccheo-Barbina, et al., 1991 | 25. m/0.32 mm/0.10 μm, 160. C @ 1. min, 2. K/min; Tend: 240. C |
Capillary | OV-1 | 2128. | de Paoli, Taccheo-Barbina, et al., 1991 | 25. m/0.32 mm/0.10 μm, 160. C @ 1. min, 2. K/min; Tend: 240. C |
Capillary | CP Sil 5 CB | 2118. | Wells, Gillespie, et al., 1985 | 120. C @ 1. min, 3. K/min; Column length: 25. m; Column diameter: 0.22 mm; Tend: 250. C |

Normal alkane RI, non-polar column, custom temperature program

Column type | Active phase | I | Reference | Comment |
---|---|---|---|---|
Capillary | Ultra-1 | 2118. | Tameo and Kiyos, 1991 | Program: not specified |
Capillary | OV-1 | 2146. | Waggott and Davies, 1984 | Hydrogen; Column length: 50. m; Column diameter: 0.32 mm; Program: not specified |
Capillary | OV-1, SE-30, Methyl silicone, SP-2100, OV-101, DB-1, etc. | 2146. | Waggott and Davies, 1984 | Hydrogen; Column length: 50. m; Column diameter: 0.32 mm; Program: not specified |
Other | Methyl Silicone | 2130. | Ardrey and Moffat, 1981 | Program: not specified |

Normal alkane RI, polar column, custom temperature program

Column type | Active phase | I | Reference | Comment |
---|---|---|---|---|
Capillary | Carbowax 20M | 3104. | Tameo and Kiyos, 1991 | Program: not specified |
Capillary | Superox 0.6; Carbowax 20M | 3120. | Waggott and Davies, 1984 | Hydrogen; Column length: 50. m; Column diameter: 0.32 mm; Program: not specified |
Capillary | Carbowax 400, Carbowax 20M, Carbowax 1540, Carbowax 4000, Superox 06, PEG 20M, etc. | 3120. | Waggott and Davies, 1984 | Hydrogen; Column length: 50. m; Column diameter: 0.32 mm; Program: not specified |

References

Plato and Glasgow, 1969
Plato, C.; Glasgow, A.R., Jr.,
Differential scanning calorimetry as a general method for determining the purity and heat of fusion of high-purity organic chemicals. Application to 95 compounds,
Anal. Chem., 1969, 41, 2, 330, https://doi.org/10.1021/ac60271a041
. [all data]
Ramsey, Lee, et al., 1980
Ramsey, J.D.; Lee, T.D.; Osselton, M.D.; Moffat, A.C.,
Gas-liquid chromatographic retention indices of 296 non-drug substances on SE-30 or OV-1 likely to be encountered in toxicological analyses,
J. Chromatogr., 1980, 184, 2, 185-206, https://doi.org/10.1016/S0021-9673(00)85641-1
. [all data]
de Paoli, Taccheo-Barbina, et al., 1991
de Paoli, M.; Taccheo-Barbina, M.; Bontempelli, G.,
Gas chromatographic system for the identification of halogenated pesticides by retention indices using n-alkanes as standards,
J. Chromatogr., 1991, 547, 355-365, https://doi.org/10.1016/S0021-9673(01)88659-3
. [all data]
Wells, Gillespie, et al., 1985
Wells, D.E.; Gillespie, M.J.; Porter, A.E.A.,
Dichlorobenzyl alkyl ether homologs as retention index markers and internal standards for the analysis of environmental samples using capillary gas chromatography,
J. Hi. Res. Chromatogr. Chromatogr. Comm., 1985, 8, 8, 443-449, https://doi.org/10.1002/jhrc.1240080818
. [all data]
Tameo and Kiyos, 1991
Tameo, O.; Kiyos, I.,
Simultaneous determination of pesticides by capillary gas chromatography,
Cannot be traslated (in Japan), 1991, 14, 2, 109-122. [all data]
Waggott and Davies, 1984
Waggott, A.; Davies, I.W.,
Identification of organic pollutants using linear temperature programmed retention indices (LTPRIs) - Part II, 1984, retrieved from http://dwi.defra.gov.uk/research/completed-research/reports/dwi0383.pdf. [all data]
Ardrey and Moffat, 1981
Ardrey, R.E.; Moffat, A.C.,
Gas-liquid chromatographic retention indices of 1318 substances of toxicological interest on SE-30 or OV-1 stationary phase,
J. Chromatogr., 1981, 220, 3, 195-252, https://doi.org/10.1016/S0021-9673(00)81925-1
. [all data]