1,2-Diiodobutane
- Formula: C4H8I2
- Molecular weight: 309.9153
- IUPAC Standard InChIKey: MIAAQPQIWLWRSI-UHFFFAOYSA-N
- CAS Registry Number: 53161-72-1
- Chemical structure:
View 3d structure (requires JavaScript / HTML 5) - Information on this page:

Gas phase thermochemistry data

Data compiled by: Hussein Y. Afeefy, Joel F. Liebman, and Stephen E. Stein
Quantity | Value | Units | Method | Reference | Comment |
---|---|---|---|---|---|
ΔfH°gas | 12.3 ± 6.4 | kJ/mol | Cm | Cline and Kistiakowsky, 1937 | Heat of formation derived by Cox and Pilcher, 1970 |

Reaction thermochemistry data

Data compiled by: Hussein Y. Afeefy, Joel F. Liebman, and Stephen E. Stein
Individual Reactions
By formula: C4H8I2 = C4H8 + I2
Quantity | Value | Units | Method | Reference | Comment |
---|---|---|---|---|---|
ΔrH° | 50.2 ± 6.3 | kJ/mol | Cm | Cline and Kistiakowsky, 1937 | gas phase; Heat of formation derived by Cox and Pilcher, 1970 |
By formula: C4H8 + I2 = C4H8I2
Quantity | Value | Units | Method | Reference | Comment |
---|---|---|---|---|---|
ΔrH° | -50.2 ± 6.3 | kJ/mol | Cm | Cline and Kistiakowsky, 1937 | gas phase |

References

Cline and Kistiakowsky, 1937
Cline, J.E.; Kistiakowsky, G.B.,
The gaseous equilibrium of 1,2-diiodobutane, butene-1 and iodine,
J. Chem. Phys., 1937, 5, 990. [all data]
Cox and Pilcher, 1970
Cox, J.D.; Pilcher, G.,
Thermochemistry of Organic and Organometallic Compounds, Academic Press, New York, 1970, 1-636. [all data]