2,6-Dimethoxybenzoquinone
- Formula: C8H8O4
- Molecular weight: 168.1467
- IUPAC Standard InChIKey: OLBNOBQOQZRLMP-UHFFFAOYSA-N
- CAS Registry Number: 530-55-2
- Chemical structure:
View 3d structure (requires JavaScript / HTML 5) - Other names: 2,6-Dimethoxy-p-benzoquinone; 2,6-Dimethoxy-1,4-benzoquinone; 2,5-Cyclohexadiene-1,4-dione, 2,6-dimethoxy-; p-Benzoquinone, 2,6-dimethoxy-; 2,6-Dimethoxy-p-quinone; 2,6-Dimethoxyquinone; 56336; 2,6-Dimethoxybenzo-1,4-quinone; 2,6-Dimethoxy-2,5-cyclohexadiene-1,4-dione; 3,5-Dimethoxy-1,4-benzoquinone; NSC 24500; Quinone, 2,6-dimethoxy-

Gas phase ion energetics data

Data compiled by: John E. Bartmess
Electron affinity determinations
EA (eV) | Method | Reference | Comment |
---|---|---|---|
1.717 ± 0.061 | TDEq | Heinis, Chowdhury, et al., 1988 | ΔGea(423 K) =-38.9 kcal/mol; ΔSea = -1.9 eu. |

Kovats' RI, non-polar column, isothermal

Column type | Active phase | Temperature (C) | I | Reference | Comment |
---|---|---|---|---|---|
Packed | SE-30 | 180. | 1506. | Llobera and García-Raso, 1987 | N2, Chromosorb P AW DMCS; Column length: 2. m |
Packed | SE-30 | 190. | 1515. | Llobera and García-Raso, 1987 | N2, Chromosorb P AW DMCS; Column length: 2. m |
Packed | SE-30 | 200. | 1522. | Llobera and García-Raso, 1987 | N2, Chromosorb P AW DMCS; Column length: 2. m |
Packed | SE-30 | 210. | 1530. | Llobera and García-Raso, 1987 | N2, Chromosorb P AW DMCS; Column length: 2. m |

References

Heinis, Chowdhury, et al., 1988
Heinis, T.; Chowdhury, S.; Scott, S.L.; Kebarle, P.,
Electron Affinities of Benzo-, Naphtho-, and Anthraquinones Determined from Gas-Phase Equilibria Measurements,
J. Am. Chem. Soc., 1988, 110, 2, 400, https://doi.org/10.1021/ja00210a015
. [all data]
Llobera and García-Raso, 1987
Llobera, A.; García-Raso, A.,
Gas chromatographic behaviour of several p-quinones,
J. Chromatogr., 1987, 393, 2, 305-311, https://doi.org/10.1016/S0021-9673(01)94227-X
. [all data]