1,1-di-p-tolylethane
- Formula: C16H18
- Molecular weight: 210.3141
- IUPAC Standard InChIKey: IDONYCOFOUUWLB-UHFFFAOYSA-N
- CAS Registry Number: 530-45-0
- Chemical structure:
View 3d structure (requires JavaScript / HTML 5) - Other names: Benzene, 1,1'-ethylidenebis[4-methyl-

Phase change data

Data compiled as indicated in comments:
TRC - Thermodynamics Research Center, NIST Boulder Laboratories, Chris Muzny director
AC - William E. Acree, Jr., James S. Chickos
Quantity | Value | Units | Method | Reference | Comment |
---|---|---|---|---|---|
Tboil | 541. | K | N/A | Vaiser, 1952 | Uncertainty assigned by TRC = 6. K; TRC |
Quantity | Value | Units | Method | Reference | Comment |
ΔvapH° | 76.5 ± 0.6 | kJ/mol | GS | Verevkin, 1999 | Based on data from 298. to 338. K.; AC |
Enthalpy of vaporization
ΔvapH (kJ/mol) | Temperature (K) | Method | Reference | Comment |
---|---|---|---|---|
75.3 ± 0.6 | 318. | GS | Verevkin, 1999 | Based on data from 298. to 338. K.; AC |

References

Vaiser, 1952
Vaiser, V.L.,
Dokl. Akad. Nauk SSSR, 1952, 87, 593. [all data]
Verevkin, 1999
Verevkin, Sergey P.,
Thermochemical Properties of Diphenylalkanes,
J. Chem. Eng. Data, 1999, 44, 2, 175-179, https://doi.org/10.1021/je980200e
. [all data]