5-Methylamino-1H-tetrazole
- Formula: C2H5N5
- Molecular weight: 99.0946
- CAS Registry Number: 53010-03-0

Condensed phase thermochemistry data

Data compiled by: Hussein Y. Afeefy, Joel F. Liebman, and Stephen E. Stein
Quantity | Value | Units | Method | Reference | Comment |
---|---|---|---|---|---|
ΔfH°solid | 202.5 | kJ/mol | Ccb | Williams, McEwan, et al., 1957 | |
Quantity | Value | Units | Method | Reference | Comment |
ΔcH°solid | -1704.2 ± 2.0 | kJ/mol | Ccb | Williams, McEwan, et al., 1957 |

Reaction thermochemistry data

Data compiled by: Hussein Y. Afeefy, Joel F. Liebman, and Stephen E. Stein
Individual Reactions
By formula: C2H5N5 = C2H5N5
Quantity | Value | Units | Method | Reference | Comment |
---|---|---|---|---|---|
ΔrH° | 8.62 | kJ/mol | Kin | Henry, Finnegan, et al., 1955 | liquid phase |

References

Williams, McEwan, et al., 1957
Williams, M.M.; McEwan, W.S.; Henry, R.A.,
The heats of combustion of substituted triazoles, tetrazoles and related high nitrogen compounds,
J. Phys. Chem., 1957, 61, 261-267. [all data]
Henry, Finnegan, et al., 1955
Henry, R.A.; Finnegan, W.G.; Lieber, E.,
Kinetics of the isomerization of substituted 5-aminotetrazoles,
J. Am. Chem. Soc., 1955, 77, 2264-2270. [all data]