N-Nonanoylmorpholine
- Formula: C13H25NO2
- Molecular weight: 227.3431
- IUPAC Standard InChIKey: NBRDJXSTGSUITP-UHFFFAOYSA-N
- CAS Registry Number: 5299-64-9
- Chemical structure:
View 3d structure (requires JavaScript / HTML 5) - Other names: N-Pelargonyl morpholide; AI 318284; Morpholine, 4-(1-oxononyl)-; Morpholine, 4-nonanoyl-; Pelargonic morpholide; 4-Nonanoylmorpholine; N-Morpholino nonanamide; 1-Nonanone, 1-(4-morpholino)-; NSC 3150

Phase change data

Data compiled by: Robert L. Brown and Stephen E. Stein
Reduced pressure boiling point
Tboil (K) | Pressure (bar) | Reference |
---|---|---|
398. to 403. | 0.0007 | Frinton Laboratories Inc., 1986 |

References

Frinton Laboratories Inc., 1986
Frinton Laboratories Inc.,
Catalog Number 11, Frinton Laboratories Inc., Vineland, NJ, 1986, 99. [all data]