1(2H)-Naphthalenone, 3,4-dihydro-
- Formula: C10H10O
- Molecular weight: 146.1858
- IUPAC Standard InChIKey: XHLHPRDBBAGVEG-UHFFFAOYSA-N
- CAS Registry Number: 529-34-0
- Chemical structure:
View 3d structure (requires JavaScript / HTML 5) - Other names: α-Tetralone; 1-Tetralone; 1,2,3,4-Tetrahydronaphthalen-1-one; 3,4-Dihydro-1(2H)-naphthalenone; 3,4-Dihydro-2H-naphthalen-1-one; 3,4-Dihydro-1(2H)-naphthaleneone; 1,2,3,4-Tetrahydro-1-naphthalenone; 1-Oxotetralin; 1-Oxo-1,2,3,4-tetrahydronaphthalene; alpha-Tetralone; 1,2,3,4-Tetrahydro-1-oxonaphthalene; 3,4-Dihydronaphthalen-1(2H)-one; NSC 5171

Condensed phase thermochemistry data

Data compiled by: Hussein Y. Afeefy, Joel F. Liebman, and Stephen E. Stein
Quantity | Value | Units | Method | Reference | Comment |
---|---|---|---|---|---|
ΔcH°solid | -5154.7 | kJ/mol | Ccb | Hock and Knauel, 1951 | Corresponding ΔfHºsolid = -210. kJ/mol (simple calculation by NIST; no Washburn corrections) |

Phase change data

Data compiled as indicated in comments:
BS - Robert L. Brown and Stephen E. Stein
AC - William E. Acree, Jr., James S. Chickos
Quantity | Value | Units | Method | Reference | Comment |
---|---|---|---|---|---|
ΔvapH° | 65.0 ± 0.3 | kJ/mol | GS | Verevkin, 1998 | Based on data from 284. to 324. K.; AC |
Reduced pressure boiling point
Tboil (K) | Pressure (bar) | Reference | Comment |
---|---|---|---|
388.2 | 0.008 | Weast and Grasselli, 1989 | BS |
Enthalpy of vaporization
ΔvapH (kJ/mol) | Temperature (K) | Method | Reference | Comment |
---|---|---|---|---|
61.5 | 403. | A | Stephenson and Malanowski, 1987 | Based on data from 388. to 535. K.; AC |

Kovats' RI, non-polar column, isothermal

Column type | Active phase | Temperature (C) | I | Reference | Comment |
---|---|---|---|---|---|
Packed | Apiezon L | 170. | 1458. | Arruda, Heinzen, et al., 1993 | N2, Chromosorb W; Column length: 1.8 m |

References

Hock and Knauel, 1951
Hock, I.H.; Knauel, G.,
Autoxydation von kohlenwasserstoffen, XIV. Mitteil. Uber die energetische stellung organischer hydroperoxyde,
Chem. Ber., 1951, 84, 1-5. [all data]
Verevkin, 1998
Verevkin, S.P.,
Thermochemistry of aromatic ketones. Experimental enthalpies of formation and structural effects,
Thermochim. Acta, 1998, 310, 229-235. [all data]
Weast and Grasselli, 1989
CRC Handbook of Data on Organic Compounds, 2nd Editon, Weast,R.C and Grasselli, J.G., ed(s)., CRC Press, Inc., Boca Raton, FL, 1989, 1. [all data]
Stephenson and Malanowski, 1987
Stephenson, Richard M.; Malanowski, Stanislaw,
Handbook of the Thermodynamics of Organic Compounds, 1987, https://doi.org/10.1007/978-94-009-3173-2
. [all data]
Orchin, Reggel, et al., 1949
Orchin, M.; Reggel, L.; Friedel, R.A.,
Aromatic cyclodehydrogenation. IX. Further studies on ring oxygen compounds,
J. Am. Chem. Soc., 1949, 71, 2743-2746. [all data]
Arruda, Heinzen, et al., 1993
Arruda, A.C.; Heinzen, V.E.F.; Yunes, R.A.,
Relationship between Kovats retention indices and molecular connectivity indices of tetralones, coumarins and structurally related compounds,
J. Chromatogr., 1993, 630, 1-2, 251-256, https://doi.org/10.1016/0021-9673(93)80461-G
. [all data]