Pentane, 3-ethyl-2,2,4-trimethyl
- Formula: C10H22
- Molecular weight: 142.2817
- IUPAC Standard InChIKey: VLIZIVHXZXQRDE-UHFFFAOYSA-N
- CAS Registry Number: 52897-18-4
- Chemical structure:
View 3d structure (requires JavaScript / HTML 5) - Other names: 3-Ethyl-2,2,4-trimethylpentane; 2,2,4-Trimethyl-3-ethylpentane

Phase change data

Data compiled as indicated in comments:
TRC - Thermodynamics Research Center, NIST Boulder Laboratories, Chris Muzny director
AC - William E. Acree, Jr., James S. Chickos
Quantity | Value | Units | Method | Reference | Comment |
---|---|---|---|---|---|
Tboil | 428.45 | K | N/A | Pomerantz, Mears, et al., 1949 | Uncertainty assigned by TRC = 0.4 K; TRC |
Quantity | Value | Units | Method | Reference | Comment |
ΔvapH° | 44.8 | kJ/mol | N/A | Reid, 1972 | AC |

References

Pomerantz, Mears, et al., 1949
Pomerantz, P.; Mears, T.W.; Howard, F.L.,
Separation and Identification of the Major C1 to C10 Components of Triptene Residue,
J. Res. Natl. Bur. Stand. (U. S.), 1949, 42, 617-32. [all data]
Reid, 1972
Reid, Robert C.,
Handbook on vapor pressure and heats of vaporization of hydrocarbons and related compounds, R. C. Wilhort and B. J. Zwolinski, Texas A Research Foundation. College Station, Texas(1971). 329 pages.$10.00,
AIChE J., 1972, 18, 6, 1278-1278, https://doi.org/10.1002/aic.690180637
. [all data]