Pentane, 3-ethyl-2,2,3-trimethyl-
- Formula: C10H22
- Molecular weight: 142.2817
- IUPAC Standard InChIKey: AJDIFHIHSYVDGP-UHFFFAOYSA-N
- CAS Registry Number: 52897-17-3
- Chemical structure:
View 3d structure (requires JavaScript / HTML 5) - Other names: 3-Ethyl-2,2,3-trimethylpentane; 2,2,3-Trimethyl-3-ethylpentane

Phase change data

Data compiled as indicated in comments:
TRC - Thermodynamics Research Center, NIST Boulder Laboratories, Chris Muzny director
AC - William E. Acree, Jr., James S. Chickos
Quantity | Value | Units | Method | Reference | Comment |
---|---|---|---|---|---|
Tfus | 230.9 | K | N/A | Meshcheryakov, Erzyutova, et al., 1952 | Uncertainty assigned by TRC = 2. K; TRC |
Quantity | Value | Units | Method | Reference | Comment |
ΔvapH° | 46.0 | kJ/mol | N/A | Reid, 1972 | AC |

References

Meshcheryakov, Erzyutova, et al., 1952
Meshcheryakov, A.P.; Erzyutova, E.I.; Petrov, A.D.,
Synthesis of C10-11 Hydrocarbons Having Two Quaternary Carbon Atoms,
Dokl. Akad. Nauk SSSR, 1952, 85, 111-13. [all data]
Reid, 1972
Reid, Robert C.,
Handbook on vapor pressure and heats of vaporization of hydrocarbons and related compounds, R. C. Wilhort and B. J. Zwolinski, Texas A Research Foundation. College Station, Texas(1971). 329 pages.$10.00,
AIChE J., 1972, 18, 6, 1278-1278, https://doi.org/10.1002/aic.690180637
. [all data]