Hexane, 2,3,4,4-tetramethyl-
- Formula: C10H22
- Molecular weight: 142.2817
- IUPAC Standard InChIKey: XDRDDPSGUQMOBO-UHFFFAOYSA-N
- CAS Registry Number: 52897-12-8
- Chemical structure:
View 3d structure (requires JavaScript / HTML 5) - Other names: 2,3,4,4-Tetramethylhexane

Phase change data

Data compiled as indicated in comments:
TRC - Thermodynamics Research Center, NIST Boulder Laboratories, Chris Muzny director
AC - William E. Acree, Jr., James S. Chickos
Quantity | Value | Units | Method | Reference | Comment |
---|---|---|---|---|---|
Tboil | 434.75 | K | N/A | Pomerantz, Mears, et al., 1949 | Uncertainty assigned by TRC = 0.4 K; TRC |
Tboil | 435.95 | K | N/A | Johnson, 1947 | Uncertainty assigned by TRC = 1. K; TRC |
Quantity | Value | Units | Method | Reference | Comment |
ΔvapH° | 46.0 | kJ/mol | N/A | Reid, 1972 | AC |

References

Pomerantz, Mears, et al., 1949
Pomerantz, P.; Mears, T.W.; Howard, F.L.,
Separation and Identification of the Major C1 to C10 Components of Triptene Residue,
J. Res. Natl. Bur. Stand. (U. S.), 1949, 42, 617-32. [all data]
Johnson, 1947
Johnson, G.C.,
J. Am. Chem. Soc., 1947, 69, 146. [all data]
Reid, 1972
Reid, Robert C.,
Handbook on vapor pressure and heats of vaporization of hydrocarbons and related compounds, R. C. Wilhort and B. J. Zwolinski, Texas A Research Foundation. College Station, Texas(1971). 329 pages.$10.00,
AIChE J., 1972, 18, 6, 1278-1278, https://doi.org/10.1002/aic.690180637
. [all data]