Hexane, 2,3,3,5-tetramethyl-
- Formula: C10H22
- Molecular weight: 142.2817
- IUPAC Standard InChIKey: GCGFXFIPOBRMQT-UHFFFAOYSA-N
- CAS Registry Number: 52897-11-7
- Chemical structure:
View 3d structure (requires JavaScript / HTML 5) - Other names: 2,3,3,5-Tetramethylhexane

Phase change data

Data compiled as indicated in comments:
TRC - Thermodynamics Research Center, NIST Boulder Laboratories, Chris Muzny director
AC - William E. Acree, Jr., James S. Chickos
Quantity | Value | Units | Method | Reference | Comment |
---|---|---|---|---|---|
Tboil | 426. | K | N/A | Whitmore, Goldsmith, et al., 1950 | Uncertainty assigned by TRC = 2. K; TRC |
Quantity | Value | Units | Method | Reference | Comment |
ΔvapH° | 45.2 | kJ/mol | N/A | Reid, 1972 | AC |

Kovats' RI, non-polar column, isothermal

Column type | Active phase | Temperature (C) | I | Reference | Comment |
---|---|---|---|---|---|
Capillary | Squalane | 100. | 903. | Heinzen, Soares, et al., 1999 | |
Capillary | Squalane | 60. | 903.3 | Chretien and Dubois, 1976 | |
Capillary | Squalane | 60. | 903. | Matukuma, 1969 | N2; Column length: 91.4 m; Column diameter: 0.25 mm |

Kovats' RI, non-polar column, custom temperature program

Column type | Active phase | I | Reference | Comment |
---|---|---|---|---|
Capillary | Squalane | 901. | Korol and Lysyuk, 1980 | Program: not specified |

Normal alkane RI, non-polar column, custom temperature program

Column type | Active phase | I | Reference | Comment |
---|---|---|---|---|
Capillary | OV-101 | 903. | Du and Liang, 2003 | Program: not specified |
Capillary | Polydimethyl siloxane | 903. | Junkes, Castanho, et al., 2003 | Program: not specified |

References

Whitmore, Goldsmith, et al., 1950
Whitmore, F.C.; Goldsmith, D.P.J.; Cook, N.C.; Yarze, J.C.; Ecke, G.G.,
The Reaction of Mesityl Oxide with t-Butylmagnesium Chloride,
J. Am. Chem. Soc., 1950, 72, 53. [all data]
Reid, 1972
Reid, Robert C.,
Handbook on vapor pressure and heats of vaporization of hydrocarbons and related compounds, R. C. Wilhort and B. J. Zwolinski, Texas A Research Foundation. College Station, Texas(1971). 329 pages.$10.00,
AIChE J., 1972, 18, 6, 1278-1278, https://doi.org/10.1002/aic.690180637
. [all data]